program: Gaussian 09
title: 000135825
version: EM64L-G09RevD.01
frameworkgroup: C1[X(C10H13N4O10P)]
method: RPBEPBE
basis: SDD
operation: Freq
keyword: #p
keyword: freq=noraman
keyword: PBEPBE/SDD
title: #p freq=noraman PBEPBE/SDD
converged: NO YES NO NO
title: Mulliken charges:
elementType: P O O O O O O O O O O N N N N C C C C C C C C C C H H H H H H H H H H H H H
charge: 1.391385 -0.242976 -0.465513 -0.446533 -0.534688 -0.279272 -0.242330 -0.217074 -0.675145 -0.675674 -0.579967 -0.192380 -0.457786 -0.410883 -0.416795 -0.022692 -0.290474 -0.114842 -0.059883 -0.316687 0.385691 0.251886 0.121866 0.111153 0.133576 0.204529 0.325409 0.264637 0.274516 0.254900 0.295850 0.374843 0.362276 0.358349 0.369378 0.357473 0.398210 0.405665
chargesum: 0.00000
title: Mulliken charges with hydrogens summed into heavy atoms:
elementType: P O O O O O O O O O O N N N N C C C C C C C C C C
charge: 1.391385 -0.242976 -0.090670 -0.084256 -0.534688 -0.279272 -0.242330 -0.217074 -0.276935 -0.270008 -0.579967 -0.192380 -0.099437 -0.041504 -0.059322 0.181837 0.034934 0.149794 0.214632 0.234064 0.385691 0.251886 0.121866 0.111153 0.133576
polarizability: 2.61869324e+02 3.17800568e+00 1.98065959e+02 1.76105458e+01 -1.72572348e+01 1.33701189e+02
1716.lowfreq: -6.2301 -4.8720 -3.5028 -0.0009 -0.0002 0.0008 7.1694 17.4946 24.5878
frequency: -4.8346 17.4768 24.5587 29.3868 51.0179 67.4220 73.3876 113.7926 122.4368 129.0633 144.6788 156.7148 167.0992 179.0008 194.4621 205.7465 220.0055 238.2522 242.0609 255.7914 269.9236 280.7308 300.8547 321.5485 346.1616 350.4813 371.9024 378.0637 384.3202 398.3975 417.8725 448.3561 475.9702 488.8360 523.9063 537.0724 542.0378 558.2096 574.3787 579.5833 615.3895 632.1212 652.4206 679.3668 689.6725 706.7522 709.3507 714.3700 725.6576 748.4375 754.5602 760.4096 816.0657 839.8134 891.9007 897.8849 929.3613 946.7753 952.8111 980.7594 1001.6171 1005.9532 1010.5848 1022.3453 1048.0791 1054.9377 1086.7340 1093.0932 1113.2629 1140.3696 1169.1807 1183.1269 1191.1436 1207.1175 1229.3840 1244.8378 1260.9749 1265.2538 1279.5813 1306.4304 1310.2472 1313.7507 1330.4362 1356.4703 1360.4856 1366.5726 1385.0600 1402.7747 1437.6648 1488.5303 1524.9552 1602.1398 1640.5937 1681.9108 1721.5183 3020.0547 3025.1294 3028.4689 3077.2042 3090.6212 3114.3406 3476.6023 3524.2022 3594.5196 3611.5873 3613.0766 3614.0013 3620.1982
redmass: 7.0863 9.6112 8.9966 7.5843 8.8953 7.4659 7.1232 8.3410 7.5891 6.3562 7.6665 1.6492 4.0010 6.8661 8.0272 5.0800 1.3997 4.3843 4.2372 6.4550 3.4877 3.8261 3.8913 9.1616 6.5789 7.8605 4.2026 1.9639 4.4085 8.0031 7.6043 8.6430 5.5789 2.2584 2.1909 2.5763 1.6333 3.5944 1.2429 7.4094 2.3258 9.2170 6.6635 5.0923 3.2921 10.2854 5.7743 6.6505 10.2120 6.4702 5.4411 2.5561 4.2986 4.0413 3.0136 3.4005 4.6423 6.8853 3.6463 4.8651 1.3426 3.3738 1.3357 4.1533 2.5374 5.5106 2.9045 5.5121 2.0373 3.0152 4.0086 1.4686 1.2021 1.3615 3.3973 1.2060 4.1680 1.4274 1.2520 1.7037 1.6025 1.5291 1.3090 1.3455 1.4647 1.5437 1.6492 1.4157 6.6502 1.0801 6.5768 6.7611 9.1001 7.3755 8.6050 1.0833 1.0861 1.0594 1.0886 1.0878 1.1072 1.0646 1.0770 1.0662 1.0665 1.0676 1.0809 1.0816
irintensity: 2.5908 0.8130 0.3963 3.4214 3.2129 2.5876 1.3411 2.1005 10.5053 7.7571 0.9938 80.7570 10.2657 4.6984 8.6814 8.1134 53.0502 2.5917 21.7358 1.9189 10.9828 23.9830 23.4178 7.0468 35.6739 29.3211 15.0824 63.8227 138.2911 1.6972 17.9196 30.8026 19.1138 68.7272 105.9867 39.4272 61.5897 20.9739 110.1440 27.6863 44.8232 23.3208 3.8148 31.8300 35.8149 13.3536 8.3832 111.3546 234.2549 43.2820 28.5470 182.6500 11.2473 9.5394 18.4333 15.9926 11.2510 363.3193 8.9942 187.5755 22.2831 104.3133 198.0227 65.5222 9.0108 6.9109 14.2504 229.4737 7.9668 39.0477 10.7305 48.2263 0.4552 15.4618 24.9324 4.9936 93.7455 48.4828 55.2435 27.7059 40.3610 30.5900 45.1515 15.9137 59.9520 20.4984 2.8611 10.5155 52.0909 12.2628 189.5923 48.1913 577.8152 867.4097 709.5181 38.9179 15.9540 8.8624 11.2532 3.6651 4.2213 29.1162 74.9558 72.6883 70.3823 32.3756 92.0705 107.5574
temp: 298.150 k
press: 1.00000 atm
elementType: 15 8 8 8 8 8 8 8 8 8 8 7 7 7 7 6 6 6 6 6 6 6 6 6 6 1 1 1 1 1 1 1 1 1 1 1 1 1
symmnumber: 1
zpe: 688283.2 jmol-1
zpe.correction: 0.262153 hartree
zpe.thermalcorrener: 0.286042 hartree
zpe.thermalcorrenthalpy: 0.286986 hartree
zpe.thermalcorrgfe: 0.207430 hartree
zpe.sumelectzpe: -1699.473447 hartree
zpe.sumelectthermal: -1699.449559 hartree
zpe.sumelectthermalent: -1699.448614 hartree
zpe.sumelectthermalfe: -1699.528170 hartree
dipole: 1.2761 -0.4163 1.4554
dipole: 1.9799
quadrupole: -189.9645 -158.0372 -141.9595
quadrupole: -12.9250 -21.6581 10.1148
quadrupole: -26.6441 5.2832 21.3609 -12.9250 -21.6581 10.1148
hfenergy: -1699.7356002 hartree
pointgroup: C01 [X(C10H13N4O10P1)]
dipole: -0.4817801 -0.1047269 -0.6030665 debye
polarizability: 260.8327301|-4.8956219|193.1500328|20.6178911|24.2469112|139.6537088 unknown
InChI: InChI=1S/C10H13N4O10P/c15-4-2(1-23-25(20,21)22)24-8(5(4)16)14-6-3(11-9(18)12-6)7(17)13-10(14)19/h2,4-5,8,11-13,15-16,20-21H,1H2
charge 0 multiplicity 1
38 atoms
P  -5.461525 -0.788664 0.121142
O  -0.556426 0.549133 1.085517
O  0.285926 2.640218 -1.744168
O  -1.540237 3.302999 0.106908
O  -4.098475 0.225408 -0.007721
O  -0.166893 -1.404051 -1.348452
O  4.117202 -3.195118 -0.689384
O  5.435054 1.436595 2.024085
O  -5.484847 -1.390637 1.749863
O  -4.853232 -2.189954 -0.652764
O  -6.804193 -0.119538 -0.372383
N  1.385321 -0.046654 -0.196973
N  3.265708 1.060521 1.043139
N  1.987558 -2.221702 -0.9871
N  4.798989 -0.55274 0.822368
C  0.394174 1.01061 0.071081
C  -0.430511 1.505807 -1.145966
C  -1.749651 1.975372 -0.470306
C  -1.937241 0.988574 0.69231
C  -2.735385 -0.274894 0.343999
C  2.675063 0.028548 0.328134
C  0.993069 -1.241864 -0.8740
C  3.621205 -0.98284 0.185228
C  3.342279 -2.213911 -0.500967
C  4.630258 0.724139 1.381844
H  0.948291 1.886501 0.458401
H  -0.615396 0.695761 -1.867739
H  -2.613671 1.970798 -1.160328
H  -2.380868 1.510918 1.554995
H  -2.783475 -0.944675 1.220948
H  -2.312007 -0.81876 -0.515086
H  0.228912 2.603021 -2.729399
H  -0.96561 3.807629 -0.532096
H  2.856115 1.942916 1.343924
H  1.696166 -3.071607 -1.481291
H  5.662383 -1.088932 0.882175
H  -6.094178 -0.897557 2.356798
H  -5.38055 -3.01817 -0.528032
