program: Gaussian 09
title: 000135820
version: EM64L-G09RevD.01
frameworkgroup: C1[X(C17H25FN2O6)]
method: RPBEPBE
basis: SDD
operation: Freq
keyword: #p
keyword: freq=noraman
keyword: PBEPBE/SDD
title: #p freq=noraman PBEPBE/SDD
converged: YES YES NO NO
title: Mulliken charges:
elementType: F O O O O O O N N C C C C C C C C C C C C C C C C C H H H H H H H H H H H H H H H H H H H H H H H H H
charge: -0.168628 -0.241635 -0.424842 -0.194996 -0.449613 -0.260021 -0.222640 -0.187438 -0.407536 0.106656 -0.126262 -0.531493 -0.019597 0.142023 -0.379225 -0.552414 -0.370277 -0.368702 0.227049 -0.186124 -0.374287 -0.352774 0.155898 -0.356984 0.104022 -0.695247 0.256035 0.296665 0.274926 0.292987 0.227581 0.241278 0.229995 0.285524 0.343283 0.213166 0.222407 0.193950 0.186572 0.351646 0.194816 0.191800 0.361166 0.186830 0.188948 0.366312 0.195433 0.196745 0.210249 0.209351 0.217422
chargesum: 0.00000
title: Mulliken charges with hydrogens summed into heavy atoms:
elementType: F O O O O O O N N C C C C C C C C C C C C C C C C C
charge: -0.168628 -0.241635 -0.081559 -0.194996 -0.088447 -0.260021 -0.222640 -0.187438 -0.041224 0.106656 0.129773 0.040098 0.273391 0.142023 0.089635 -0.036895 0.065296 0.011820 0.227049 0.165521 0.012330 0.023003 0.155898 0.035193 0.104022 -0.058226
polarizability: 2.87668473e+02 -6.19146487e+00 1.94373752e+02 3.26484817e+01 -5.42466041e+00 1.76839857e+02
1716.lowfreq: -14.7741 -3.0621 -1.7142 -0.0009 -0.0008 0.0005 10.8701 16.4493 33.7914
frequency: 3.7503 16.4093 33.6481 39.9334 43.5349 50.2435 72.9977 78.7273 91.6726 95.8025 112.5825 124.0415 131.5336 142.3655 145.7345 147.5264 164.8451 168.6136 182.8933 204.0056 223.1029 224.8346 233.4087 253.1603 286.1908 298.3855 311.5129 315.0797 329.3281 343.0192 351.5819 373.8317 381.6518 412.6174 416.5278 442.5783 456.8412 462.8470 493.3095 533.8630 553.0851 569.2803 620.9940 666.3412 691.6948 711.6218 713.2945 720.0998 721.6597 728.8425 747.1581 761.8209 769.9957 787.4841 821.1265 826.4339 846.0089 889.5178 899.8419 904.8179 929.6611 939.1000 951.2673 974.2933 991.1122 1002.2416 1007.1706 1026.8718 1030.0303 1040.8030 1058.7670 1060.2242 1075.5352 1079.3106 1083.3097 1089.9926 1104.6076 1116.6351 1125.5882 1146.2140 1182.2705 1186.2613 1199.7284 1201.2508 1222.7570 1225.2313 1230.3576 1241.4886 1248.9755 1264.7599 1268.5784 1272.4140 1282.2725 1285.7548 1293.7138 1297.0310 1312.9460 1316.0169 1324.1748 1336.2849 1347.0203 1353.3358 1358.5634 1362.1634 1364.2656 1390.1354 1407.3043 1414.9849 1417.6711 1451.5652 1462.0338 1463.3910 1463.4700 1468.5526 1475.1890 1476.6091 1482.9741 1488.9487 1613.9250 1619.7735 1638.8909 1662.6802 2943.4443 2950.8665 2952.7207 2960.8636 2970.1639 2972.9758 2974.9588 2987.1714 2991.7411 2996.6925 3005.4572 3016.6805 3026.7256 3035.7908 3047.7400 3053.9134 3056.1756 3069.3995 3072.3427 3075.7339 3124.8723 3136.0936 3523.4624 3563.8919 3577.4062
redmass: 6.4080 6.6331 7.3109 3.7787 4.0347 1.7069 6.3255 7.3552 2.8427 1.6892 5.9005 6.0534 3.8783 3.0438 2.1748 2.8789 4.6406 3.7256 6.3452 1.3256 1.2746 4.0349 3.2044 3.8994 11.8959 4.1284 3.2136 1.3553 7.7055 4.8021 4.7218 7.5758 10.9447 3.4717 3.3941 3.3051 6.9214 4.2693 3.2391 3.8645 6.4400 2.2745 4.9971 4.9749 2.0430 7.3973 7.9992 4.4349 1.1645 1.1192 8.0482 1.2345 2.2050 3.3215 1.8465 2.3234 3.3528 1.8775 2.1754 1.7634 3.0721 2.9434 1.5680 3.3713 1.2741 3.9609 2.8673 3.6174 2.3495 3.1616 2.8175 2.8299 2.6932 2.1216 2.4955 2.4527 1.7855 2.6331 7.0562 2.9208 1.2757 1.7264 3.9614 1.3462 1.3439 1.3518 1.3449 1.4317 1.6475 1.2390 1.3672 1.4219 1.0514 1.6457 1.1016 1.1041 1.5353 1.5154 1.6554 1.1874 1.5678 1.8634 1.6563 1.6841 1.6618 1.2174 4.2138 1.3578 1.1239 1.0864 1.0749 1.0694 1.0889 1.0732 1.0722 1.0445 1.0837 1.0925 9.3330 5.8701 12.1750 6.3714 1.0668 1.0593 1.0589 1.0593 1.0587 1.0368 1.0565 1.0960 1.0640 1.0977 1.0884 1.1030 1.0978 1.1044 1.0950 1.0626 1.1031 1.1007 1.0992 1.0888 1.0962 1.1032 1.0771 1.0664 1.0667
irintensity: 0.0626 0.4058 0.5979 0.4443 0.1545 0.2346 0.8573 1.1741 0.8946 0.9723 4.0117 7.4362 3.9341 4.3848 0.6967 4.2775 12.1746 7.0057 20.5860 99.0014 2.3860 10.6987 13.1288 7.8845 2.0915 19.2435 37.0518 157.5705 7.0947 11.6412 2.3442 1.9652 9.4765 10.9769 5.9748 15.3069 1.6166 2.5453 6.6120 10.2795 13.5333 4.4219 6.2689 22.6922 12.1874 14.0922 9.6726 18.5480 14.1733 1.2801 4.9401 2.3808 119.1068 7.0802 8.5120 2.7543 36.1056 5.3327 10.5338 6.5469 47.4018 7.3981 65.2762 68.8227 1.5376 1.2711 44.6136 48.3775 22.8881 51.9184 33.0117 15.1677 37.7829 0.3599 9.5364 37.6240 9.9482 3.1791 65.3414 79.7279 13.8187 1.3115 39.6874 23.5829 12.8485 16.2504 19.7905 81.6519 139.1760 1.4233 3.5948 74.2720 0.5640 106.6496 0.1680 0.2230 5.5960 16.6464 26.8614 2.7845 19.5239 11.0038 0.4686 7.2355 12.9751 11.7033 51.9295 7.0767 26.9068 11.9827 0.5644 0.4895 9.1781 2.2436 2.6485 11.8689 4.0675 25.6075 49.0564 301.0840 160.1034 602.8301 21.9431 6.1025 4.0350 25.4104 105.9969 36.0721 32.8199 1.3861 27.5683 2.8814 2.1177 0.4746 5.5949 57.7952 55.7343 2.0651 73.5485 98.7103 52.8707 6.5002 94.8996 1.9848 65.3656 9.9589 14.4158
temp: 298.150 k
press: 1.00000 atm
elementType: 9 8 8 8 8 8 8 7 7 6 6 6 6 6 6 6 6 6 6 6 6 6 6 6 6 6 1 1 1 1 1 1 1 1 1 1 1 1 1 1 1 1 1 1 1 1 1 1 1 1 1
symmnumber: 1
zpe: 1073297.8 jmol-1
zpe.correction: 0.408798 hartree
zpe.thermalcorrener: 0.436687 hartree
zpe.thermalcorrenthalpy: 0.437631 hartree
zpe.thermalcorrgfe: 0.346365 hartree
zpe.sumelectzpe: -1321.472579 hartree
zpe.sumelectthermal: -1321.444689 hartree
zpe.sumelectthermalent: -1321.443745 hartree
zpe.sumelectthermalfe: -1321.535012 hartree
dipole: 8.2131 1.8557 2.4393
dipole: 8.7663
quadrupole: -193.7289 -156.1551 -161.4411
quadrupole: 6.4179 -7.1211 1.8462
quadrupole: -23.2872 14.2866 9.0006 6.4179 -7.1211 1.8462
hfenergy: -1321.8813761 hartree
pointgroup: C01 [X(C17H25F1N2O6)]
dipole: -3.2401932 0.0314452 -1.1812121 debye
polarizability: 287.6703158|24.2798957|194.0974206|22.5575706|-6.3160371|177.1143457 unknown
InChI: InChI=1S/C17H25FN2O6/c1-2-3-4-5-6-7-12(22)17(25)8-14(26-13(17)10-21)20-9-11(18)15(23)19-16(20)24/h9,13-14,19,21,25H,2-8,10H2,1H3
charge 0 multiplicity 1
51 atoms
F  5.545011 2.343806 -0.45852
O  1.880127 -0.577018 -1.903823
O  -0.628076 -2.020909 -1.424275
O  -1.148243 0.818151 0.815024
O  1.69386 2.195159 -2.266322
O  3.471477 -2.361234 1.525942
O  6.725872 1.015422 1.812421
N  3.383081 -0.595478 -0.017579
N  5.078731 -0.646992 1.627099
C  -0.197777 -0.783519 -0.75386
C  0.582896 0.131954 -1.755317
C  0.916512 -1.218556 0.227698
C  2.190979 -1.26523 -0.660434
C  -1.384825 -0.078496 -0.038936
C  0.770189 1.588229 -1.297372
C  -2.791367 -0.520761 -0.403083
C  -3.903077 0.226222 0.3552
C  -5.313248 -0.250478 -0.056667
C  3.949826 -1.279728 1.080771
C  3.924695 0.584529 -0.523793
C  -6.44267 0.477342 0.706694
C  -7.856811 0.012405 0.292282
C  5.025408 1.1549 0.059458
C  -8.987695 0.736852 1.057822
C  5.711874 0.56972 1.213955
C  -10.396928 0.268187 0.635407
H  0.139456 0.131179 -2.767969
H  0.690761 -2.205706 0.65456
H  1.014515 -0.486167 1.045079
H  2.494573 -2.296704 -0.897798
H  -0.212198 2.101335 -1.305035
H  1.171516 1.637545 -0.266455
H  -2.922652 -0.402948 -1.502398
H  -2.852661 -1.615919 -0.237958
H  -0.980438 -1.822642 -2.328723
H  -3.805436 1.315172 0.179613
H  -3.75876 0.08275 1.443251
H  -5.401281 -1.343467 0.117372
H  -5.45384 -0.097111 -1.147771
H  3.430583 1.016946 -1.402372
H  -6.309322 0.318078 1.796987
H  -6.35274 1.571139 0.539719
H  1.786938 3.161138 -2.070752
H  -7.992759 0.174156 -0.797835
H  -7.947802 -1.081812 0.457413
H  5.507169 -1.123665 2.427629
H  -8.895697 1.83015 0.894673
H  -8.853336 0.573093 2.146546
H  -10.525433 -0.815539 0.818044
H  -10.568133 0.448492 -0.442784
H  -11.186547 0.800928 1.196472
