program: Gaussian 09
title: 000135808
version: EM64L-G09RevD.01
frameworkgroup: C1[X(C6H9NO9S)]
method: RPBEPBE
basis: SDD
operation: Freq
keyword: #p
keyword: freq=noraman
keyword: PBEPBE/SDD
title: #p freq=noraman PBEPBE/SDD
converged: YES YES NO NO
title: Mulliken charges:
elementType: S O O O O O O O O O N C C C C C C H H H H H H H H H
charge: 1.101217 -0.404307 -0.191448 -0.541408 -0.403696 -0.387309 -0.479677 -0.467592 -0.232825 -0.270291 -0.572300 0.185042 -0.546339 -0.574338 0.181621 0.197923 0.215369 0.318876 0.296662 0.317252 0.326228 0.368933 0.398145 0.387399 0.386911 0.389950
chargesum: 0.00000
title: Mulliken charges with hydrogens summed into heavy atoms:
elementType: S O O O O O O O O O N C C C C C C
charge: 1.101217 -0.006162 -0.191448 -0.154010 -0.016785 0.002641 -0.479677 -0.467592 -0.232825 -0.270291 -0.203367 0.185042 0.069200 0.069142 0.181621 0.197923 0.215369
polarizability: 1.38010553e+02 2.24865606e-01 1.23995775e+02 -1.28133151e+00 1.21009112e+00 1.18285047e+02
1716.lowfreq: -6.0114 -0.0022 -0.0019 -0.0017 5.2942 11.4475 36.3993 38.5734 44.8143
frequency: 36.3541 38.4824 44.7964 57.6411 71.0985 78.1418 82.6456 105.1948 135.0387 154.5387 172.7550 182.3325 205.5429 240.3982 247.0330 281.5091 302.0788 320.8079 322.1005 354.4435 375.7545 387.8244 437.4277 488.6107 499.0768 510.7192 548.9933 559.5969 573.8399 581.3358 617.8394 633.6315 644.6962 656.5269 726.1529 764.9681 834.2545 850.7265 868.2279 889.9006 910.2146 930.3493 952.4643 1037.3198 1039.0928 1061.1255 1080.0239 1091.3025 1115.9793 1163.8182 1226.9139 1240.0892 1265.1462 1275.5291 1300.2852 1350.6895 1377.2754 1398.6756 1433.3057 1439.3130 1627.9994 1656.9139 1662.7905 3014.7259 3029.5015 3077.9957 3089.6780 3243.3311 3478.3342 3509.5494 3514.8644 3527.0495
redmass: 8.9055 9.5862 8.0843 10.1303 10.1258 11.2083 9.9862 7.7952 3.9465 4.6385 7.4037 11.0394 2.3773 2.3998 5.5840 4.6761 6.9275 2.9421 7.9221 7.8823 5.8280 8.8482 4.5417 3.9738 1.7834 2.2214 3.9907 7.3511 3.2958 2.3040 2.8454 1.9160 1.7324 1.5646 5.8189 3.5702 3.9228 9.3036 4.0956 3.2672 2.0776 2.6598 3.9466 2.8831 2.3214 2.6039 2.0931 1.4365 1.9100 2.7354 1.1940 1.5349 1.6410 1.6013 1.8005 1.9578 2.1536 1.5624 1.1019 1.0822 7.4235 8.6404 9.2347 1.0639 1.0610 1.0958 1.0989 1.0742 1.0662 1.0640 1.0641 1.0643
irintensity: 1.1639 0.6185 0.6244 2.2770 3.8902 1.1827 0.7136 0.2163 26.4286 17.6354 6.7883 1.6591 12.2071 54.7673 1.9079 22.4890 9.2424 1.4743 4.0683 0.3784 47.5079 39.2548 1.8780 26.3097 5.7480 21.8613 125.5562 216.4166 59.5172 54.9128 7.8931 74.1790 84.0143 77.5778 91.1970 13.5284 65.2898 83.9688 3.5577 36.7824 67.5583 15.2257 86.4918 208.0570 259.7009 135.3588 116.5780 138.5162 53.2166 15.2362 2.7855 4.3236 1.7580 4.2947 23.6033 146.1706 96.6299 20.3652 73.1400 44.1607 140.9892 49.1306 329.3929 12.4105 5.8754 2.7620 1.0812 135.8642 68.2600 44.7806 37.6532 54.7656
temp: 298.150 k
press: 1.00000 atm
elementType: 16 8 8 8 8 8 8 8 8 8 7 6 6 6 6 6 6 1 1 1 1 1 1 1 1 1
symmnumber: 1
zpe: 442646.3 jmol-1
zpe.correction: 0.168595 hartree
zpe.thermalcorrener: 0.187695 hartree
zpe.thermalcorrenthalpy: 0.188639 hartree
zpe.thermalcorrgfe: 0.119875 hartree
zpe.sumelectzpe: -1362.365273 hartree
zpe.sumelectthermal: -1362.346173 hartree
zpe.sumelectthermalent: -1362.345229 hartree
zpe.sumelectthermalfe: -1362.413993 hartree
dipole: -4.4936 0.2144 -3.3152
dipole: 5.5883
quadrupole: -104.3493 -92.9533 -114.2072
quadrupole: -2.5217 -3.7369 5.5176
quadrupole: -0.5126 10.8833 -10.3706 -2.5217 -3.7369 5.5176
hfenergy: -1362.5338685 hartree
pointgroup: C01 [X(C6H9N1O9S1)]
dipole: 1.7806703 0.034461 1.2891639 debye
dipolederiv: 1.9731467 0.0791807 -0.2069249 0.1767045 1.3400215 0.0533358 -0.0881417 -0.0027809 1.4593983 -0.4129789 0.1431784 -0.0550422 0.1913916 -0.9681632 0.4119261 -0.0425828 0.3330117 -0.4570217 -0.3461146 0.0889919 -0.1196454 0.0123504 -0.587345 -0.1417901 -0.1411979 0.144568 -0.7745912 -0.8252583 0.0230975 0.2103275 -0.0103482 -0.2519753 -0.0861537 0.3590861 -0.1696402 -0.835714 -1.0638808 0.0188663 -0.5810736 0.021326 -0.39024 0.0592895 -0.5240032 0.0575997 -0.653418 -0.4586312 -0.2378021 0.1304113 -0.2613795 -0.9206924 0.5277748 0.1565344 0.5119764 -0.5889968 -0.597789 -0.0370498 0.018957 -0.0828168 -0.6232902 -0.0925442 0.0064941 0.0293338 -0.4289801 -0.6859382 -0.0114143 -0.0334897 0.049291 -0.5299461 0.1469353 -0.1729418 0.0795621 -0.4980358 -0.7281726 0.0940695 0.0866966 0.054664 -0.3398562 -0.1312983 -0.1387171 -0.0621921 -0.8822382 -0.4163721 -0.1358346 0.1531216 -0.0689896 -0.7204285 -0.1270567 0.2470541 0.2099709 -0.8799397 -0.4617834 -0.1526001 0.0679953 -0.304364 -0.5000231 0.018961 0.0357526 0.0473126 -0.4298651 0.377793 0.0001686 -0.0652278 -0.0560529 0.1929829 -0.0730363 -0.4019187 -0.2196474 0.0743277 -0.3989966 0.0904839 0.0618425 0.1086294 -0.0126382 -0.0152259 0.4863454 -0.0238681 -0.1111798 -0.1099396 -0.0309128 0.0139428 -0.0027803 -0.298781 -0.0212301 0.0624138 -0.2160794 -0.2155774 0.3894333 -0.1636412 0.257852 -0.1973228 1.2372075 -0.1290493 0.2390782 -0.2431375 1.0318398 1.5819242 -0.2034133 0.3146917 -0.1808064 0.26078 0.1456803 0.2714911 0.1202714 1.306795 0.3596049 0.3145287 -0.3225402 0.2553322 1.4364975 -0.2189817 -0.4094915 -0.3811332 1.2054998 0.1174831 0.0126834 0.020498 0.0140288 0.0731992 0.0596366 -0.0018373 0.0591664 0.1024908 0.0871967 -0.0355428 0.0085079 -0.0249103 0.0506365 -0.0819552 -0.0189502 -0.0674075 0.1023412 0.0619391 -0.0372134 0.0706024 -0.0728269 0.1075666 -0.0206846 0.0720819 0.0144003 0.1291475 0.1042483 0.0514094 -0.071644 0.0110768 0.0917135 0.002236 -0.0465107 0.0476401 0.1303014 0.0971126 0.0979109 -0.0289061 0.2417887 0.3210828 -0.0579507 -0.0367458 -0.0215559 0.2805876 0.3533602 -0.0592925 -0.0542571 -0.030203 0.3184858 -0.0668851 -0.0596399 -0.1127931 0.1976338 0.3768437 0.0138072 -0.0065754 0.0804394 0.0810999 -0.0104676 -0.0225868 0.0754222 0.2868335 0.2525819 0.0375391 0.0976999 0.0491747 0.3658239 -0.0456071 0.1420746 -0.0570187 0.2200112 0.3731874 0.0388011 0.0321801 0.0266031 0.2662815 -0.105859 0.0268589 -0.1529816 0.2283501 unknown
polarizability: 137.9234523|-1.0278745|123.9749693|-1.4723763|-1.3264144|118.3929531 unknown
InChI: InChI=1S/C6H9NO9S/c8-3(9)1-6(5(12)13,2-4(10)11)7-17(14,15)16/h7-8,10,12,14H,1-2H2
charge 0 multiplicity 1
26 atoms
S  -2.653108 -0.168978 0.164322
O  0.318463 -2.67351 0.055888
O  -0.285984 -1.633353 -1.930565
O  -3.515443 0.487008 1.655569
O  3.728583 -0.672227 1.407403
O  0.809718 3.255081 -1.242012
O  -3.020816 -1.719542 -0.053453
O  -2.921052 0.92119 -0.989124
O  2.936235 -0.916223 -0.76033
O  0.106524 2.566486 0.85139
N  -0.981407 -0.080244 0.96386
C  0.21936 -0.240672 0.060427
C  1.382735 -0.34536 1.086631
C  0.396846 0.910429 -0.970052
C  0.0594 -1.565001 -0.736091
C  2.71865 -0.668716 0.446777
C  0.414483 2.283604 -0.337259
H  1.148013 -1.145697 1.808853
H  1.474442 0.592564 1.663201
H  1.322447 0.753169 -1.54983
H  -0.427211 0.881485 -1.708391
H  -0.951458 0.873135 1.397254
H  0.137195 -3.504036 -0.461028
H  -3.683391 -0.294972 2.258754
H  4.597097 -0.907337 0.980381
H  0.760778 4.155817 -0.818773
