program: Gaussian 09
title: 000135801
version: EM64L-G09RevD.01
frameworkgroup: C1[X(C7H6N4OS)]
method: RPBEPBE
basis: SDD
operation: Freq
keyword: #p
keyword: freq=noraman
keyword: PBEPBE/SDD
title: #p freq=noraman PBEPBE/SDD
converged: YES YES NO NO
title: Mulliken charges:
elementType: S O N N N N C C C C C C C H H H H H H
charge: 0.298010 -0.198402 -0.190578 0.035910 -0.362562 -0.000903 -0.313122 0.317632 -0.203427 -0.678061 -0.113371 0.020051 -0.238662 0.261042 0.239576 0.295470 0.273473 0.317184 0.240739
chargesum: 0.00000
title: Mulliken charges with hydrogens summed into heavy atoms:
elementType: S O N N N N C C C C C C C
charge: 0.298010 -0.198402 -0.190578 0.035910 -0.045377 -0.000903 0.187496 0.317632 -0.203427 -0.109118 -0.113371 0.020051 0.002077
polarizability: 1.75772236e+02 -7.14165422e+00 1.30564593e+02 4.41411682e-01 1.00216316e+00 5.56084136e+01
1716.lowfreq: -9.6980 -9.2109 -0.0003 0.0027 0.0031 2.5669 77.7053 91.0081 147.6190
frequency: 77.7027 91.0055 147.6189 178.3061 187.4773 244.6836 302.8860 332.7508 400.7112 464.8237 484.8440 515.6895 532.9578 570.7077 597.8120 629.6304 644.4108 648.9832 713.7452 738.3472 770.2353 856.4332 880.2803 881.0461 942.4614 967.5263 1014.4271 1027.3614 1089.6621 1149.2049 1167.7538 1200.0268 1235.9236 1282.9736 1315.0736 1335.7778 1352.4111 1372.6764 1439.1621 1452.0620 1474.7752 1508.7400 1536.4673 1598.6183 1637.7198 2990.6885 3051.6832 3064.3467 3120.5528 3145.5059 3543.8750
redmass: 5.6233 6.0405 5.8408 2.4673 6.0357 6.3816 6.0815 8.1083 12.0388 6.4639 2.6898 10.3099 1.3478 7.4901 8.0885 4.4419 11.3845 10.6134 3.4635 8.5740 11.3401 2.1324 2.7953 1.8612 7.2289 2.6060 1.4867 4.2969 3.7742 2.5691 1.3259 1.9689 3.0776 1.2113 2.9146 2.1351 1.4912 1.9743 5.2598 1.1468 1.1226 3.8881 9.4427 6.5744 12.6006 1.0595 1.0857 1.0772 1.0925 1.1091 1.0795
irintensity: 0.3037 0.1642 1.2012 1.1215 0.9018 3.8752 2.4018 0.0371 7.7508 3.7779 52.0088 2.8527 63.9077 1.4833 3.4884 1.3028 3.2125 1.2849 0.3581 7.5803 3.6770 6.7610 12.6851 8.7348 40.7918 6.0152 0.7308 5.4860 78.2507 6.4181 0.7425 0.3681 21.2825 21.6157 37.1926 8.0416 12.2464 16.3478 56.4572 30.1028 22.0549 20.1326 350.7226 73.8036 406.1923 37.1960 5.1239 27.6981 21.8215 6.7625 32.5504
temp: 298.150 k
press: 1.00000 atm
elementType: 16 8 7 7 7 7 6 6 6 6 6 6 6 1 1 1 1 1 1
symmnumber: 1
zpe: 346382.0 jmol-1
zpe.correction: 0.131930 hartree
zpe.thermalcorrener: 0.142179 hartree
zpe.thermalcorrenthalpy: 0.143123 hartree
zpe.thermalcorrgfe: 0.095545 hartree
zpe.sumelectzpe: -961.686996 hartree
zpe.sumelectthermal: -961.676747 hartree
zpe.sumelectthermalent: -961.675803 hartree
zpe.sumelectthermalfe: -961.723382 hartree
dipole: -7.4469 10.9815 -0.0231
dipole: 13.2683
quadrupole: -93.0506 -79.2319 -81.9040
quadrupole: 8.1347 -1.2176 0.1991
quadrupole: -8.3218 5.4969 2.8249 8.1347 -1.2176 0.1991
hfenergy: -961.8189262 hartree
pointgroup: C01 [X(C7H6N4O1S1)]
dipole: 3.2459062 4.088231 -0.0246235 debye
dipolederiv: -0.537739 -0.0282786 0.0350647 -0.0260036 0.0412226 -0.0268085 -0.0687867 -0.0212821 -0.0099981 -0.7718295 -0.3363187 -0.0093101 -0.5875032 -0.9506333 -0.0116599 -0.009227 -0.0069568 -0.3419557 -0.9226116 -0.119672 -0.042078 -0.0028124 -0.4628844 -0.0072926 -0.0098901 0.0541389 -0.1059543 -0.8782293 0.076955 -0.025591 -0.1664686 -0.3154175 -0.0065063 -0.0018135 0.0129706 -0.1858208 -0.9495644 0.0325837 -0.0099482 -0.0114323 -0.6297006 0.0019779 -0.0125914 0.0162074 -0.2053171 -0.4872695 0.0238905 -0.0060983 -0.4053619 -0.9582594 -0.0050045 -0.0047364 0.0031369 -0.2667029 0.3696908 0.1950191 0.0998847 0.2245889 0.1901016 0.0263987 0.054743 0.0715054 0.315996 0.7532508 -0.0682843 0.018848 0.0380496 0.5333568 -0.0135043 -0.0024888 -0.0519791 0.1008563 1.1659785 -0.0712382 0.0076307 0.1205293 0.3829756 0.0406037 0.0819263 0.0000957 -0.0392218 0.0494678 0.1288421 -0.0161024 0.1945499 0.1983225 -0.0843673 -0.017921 -0.0691207 0.1389446 -0.3641195 -0.4652088 -0.0092601 -0.411093 -0.1003052 -0.0167755 -0.0188867 -0.0114501 -0.0354709 1.1782093 0.3868668 0.0223798 0.6751655 1.4724615 0.0077666 0.0258926 0.0056659 0.2388463 1.1002951 0.2636916 0.0225338 0.5203182 0.5650862 0.0091293 0.0260556 0.0063795 -0.0189808 -0.0129115 -0.0398956 0.0008708 -0.0529369 0.0265196 -0.0336907 -0.0453643 -0.1106764 -0.1010074 0.0632835 0.05922 -0.0386158 -0.0409742 -0.087788 0.0682448 -0.0036461 0.0791005 0.0399087 0.0961171 0.0109201 0.0045071 -0.0600448 -0.0070781 0.054534 0.0748859 0.0412274 -0.0862909 -0.0468677 -0.0420774 -0.0471663 -0.0747849 0.0554718 -0.0053329 -0.0604503 -0.0213627 0.0775037 0.119162 -0.0405541 -0.0062146 -0.0141235 0.1690188 -0.0004155 -0.0078158 0.0012506 0.3465334 0.0756869 0.033539 -0.0013347 0.0803379 -0.1224706 0.0027031 0.0001146 0.0011492 0.138132 unknown
polarizability: 176.5670659|3.7098872|129.697184|1.5420272|-2.2078211|55.6809931 unknown
InChI: InChI=1S/C7H6N4OS/c12-6-4-5(8-3-9-6)11-1-2-13-7(11)10-4/h3,8H,1-2H2
charge 0 multiplicity 1
19 atoms
S  3.154333 -1.344583 0.164516
O  -2.831363 -1.863333 -0.03757
N  1.209456 0.503868 0.035568
N  0.273579 -1.59539 0.033631
N  -0.919658 1.84095 -0.005957
N  -2.930262 0.498394 -0.051541
C  2.400299 1.354027 0.180797
C  -0.164816 0.681205 0.022176
C  1.40362 -0.900056 0.057065
C  3.583784 0.467388 -0.292951
C  -0.745606 -0.609355 0.011543
C  -2.205912 -0.774923 -0.027128
C  -2.317641 1.656674 -0.040425
H  2.527563 1.656412 1.238011
H  2.328785 2.259853 -0.447472
H  3.708742 0.510395 -1.385366
H  4.52295 0.730414 0.213491
H  -0.513975 2.778049 0.004811
H  -2.898977 2.587412 -0.0570
