program: Gaussian 09
title: 000135792
version: EM64L-G09RevD.01
frameworkgroup: C1[X(C16H24N2O2)]
method: RPBEPBE
basis: SDD
operation: Freq
keyword: #p
keyword: freq=noraman
keyword: PBEPBE/SDD
title: #p freq=noraman PBEPBE/SDD
converged: YES YES NO NO
title: Mulliken charges:
elementType: O O N N C C C C C C C C C C C C C C C C H H H H H H H H H H H H H H H H H H H H H H H H
charge: -0.241431 -0.429163 -0.341828 -0.255518 -0.159561 -0.411039 -0.421226 -0.354269 -0.415886 0.112747 0.068303 -0.386270 0.347694 0.395404 -0.346640 -0.369506 -0.436831 -0.834946 -0.824344 -0.237135 0.219197 0.247167 0.191021 0.217592 0.187237 0.187808 0.212313 0.174254 0.210378 0.288688 0.203802 0.266128 0.265703 0.198579 0.236306 0.237878 0.238609 0.229162 0.248129 0.247658 0.246117 0.228240 0.228996 0.330480
chargesum: 0.00000
title: Mulliken charges with hydrogens summed into heavy atoms:
elementType: O O N N C C C C C C C C C C C C C C C C
charge: -0.241431 -0.098682 -0.053140 -0.255518 0.059636 0.027149 -0.016397 0.045852 -0.031255 0.112747 0.068303 0.083661 0.347694 0.395404 0.117643 -0.133200 -0.198954 -0.119045 -0.102329 -0.008139
polarizability: 1.82053916e+02 -7.95509533e+00 2.02480787e+02 1.68458982e+00 -4.25056535e+00 1.80816376e+02
1716.lowfreq: -16.4564 -7.5366 -0.0007 -0.0007 -0.0004 8.1640 11.8915 27.4292 50.8463
frequency: -11.7719 27.3509 50.6999 52.7032 60.0803 71.8444 95.4514 99.7240 118.3267 134.7793 171.2840 189.1161 217.0119 220.5084 230.3192 238.2787 262.8510 276.3353 304.4222 321.2127 331.6900 358.0287 378.4407 394.7313 424.7360 450.7521 481.9702 506.0593 512.1287 519.9654 550.5665 562.2461 604.9621 631.1661 700.8686 722.5517 755.2767 782.3423 785.3992 793.0157 819.3956 840.5514 867.6538 903.5188 914.0174 924.5761 926.1063 928.4258 965.9163 976.5900 981.5005 1003.1234 1030.2054 1031.6344 1040.8636 1043.7627 1049.1194 1067.6430 1072.5469 1073.0327 1099.9535 1120.6857 1128.0954 1152.2830 1163.3766 1179.3787 1207.2282 1227.7825 1248.5106 1256.9042 1258.8720 1265.5041 1276.0958 1299.0559 1302.6951 1317.0744 1331.0336 1337.1086 1344.6652 1350.0709 1359.8555 1360.7060 1369.6637 1383.2680 1393.1130 1405.3266 1436.3678 1438.1657 1447.6717 1453.3987 1455.4598 1460.0699 1465.8432 1468.0197 1472.5188 1474.3007 1477.5428 1482.9358 1491.7013 1585.7998 1595.5634 1602.1036 2840.5163 2849.5052 2962.4279 2977.4229 2980.7245 2982.4946 2988.4922 2996.0868 2998.3139 3029.2714 3034.1991 3050.4843 3054.5038 3056.6355 3065.6104 3074.9368 3090.1320 3098.9723 3110.7631 3120.4152 3130.6593 3156.7026 3460.9035 3554.7392
redmass: 3.1311 3.1825 4.7773 4.3787 3.4156 3.0336 2.6053 3.5294 1.0931 2.0972 1.7484 4.5456 3.6695 2.5403 2.2107 2.3945 3.2485 2.7557 1.7211 1.8769 2.8701 2.7931 3.5859 3.6569 2.8934 3.4641 3.8012 2.2576 2.0580 3.0454 5.4672 4.3621 3.9054 2.2716 3.5367 3.8101 3.9092 2.1572 1.2299 1.6584 2.8413 1.6672 2.1307 1.3076 2.6066 2.3017 1.8367 2.7605 4.5085 1.6406 1.3381 3.7008 2.0495 2.1187 1.6214 1.8451 2.0660 1.7254 1.6785 1.7539 1.6266 2.2119 2.9013 1.4479 1.4701 1.1607 1.6532 2.6023 1.7888 1.6403 1.6756 1.4997 1.8543 1.2439 1.2336 1.3249 1.3687 1.4028 1.4364 1.4080 3.5444 1.6717 1.5646 1.4480 1.2591 1.2367 1.1902 1.6914 1.2374 1.3750 1.7965 1.0886 1.0892 1.0471 1.1120 1.0899 1.1088 1.3190 1.1009 7.5464 7.0487 6.1104 1.0734 1.0767 1.0636 1.0408 1.0380 1.0655 1.0612 1.0592 1.0640 1.0911 1.0933 1.0955 1.1036 1.0961 1.1020 1.0997 1.0991 1.0975 1.0995 1.0863 1.0915 1.0993 1.0742 1.0663
irintensity: 2.0223 1.1935 0.1175 0.4091 0.0614 4.8284 0.6085 0.4189 0.5924 0.3184 0.2511 0.3504 1.4557 0.0660 2.7538 5.4164 3.4617 7.4181 93.5530 54.6050 2.5412 5.0757 15.7688 1.0074 29.3931 2.1267 1.0106 13.4383 25.7625 0.2953 0.7742 1.9054 10.1466 60.9764 5.1097 1.1927 0.7187 5.8867 45.9320 0.7767 4.0063 7.5108 7.9281 0.0220 0.9916 4.9791 2.5076 7.3037 122.2129 7.4856 0.3150 18.7912 13.9652 10.3395 9.0136 2.9257 0.5541 23.7541 3.0986 12.6996 26.9904 5.9221 27.8844 22.8021 25.8200 2.5113 1.9421 78.9021 0.6803 1.0779 26.0321 21.7418 14.7869 32.0249 27.4512 6.4475 17.6781 9.7924 10.2192 23.1929 2.8460 12.3752 8.1348 19.9052 16.2940 16.1825 12.5324 14.4607 19.3032 0.7442 4.6315 10.9916 7.9444 14.4616 8.3918 6.8592 14.2678 30.0665 23.5413 197.9184 4.3832 33.1898 52.3446 118.5575 37.4955 17.3924 18.8821 54.2786 38.7655 31.5927 35.6094 59.9408 55.9387 21.0461 41.6202 17.6357 6.5103 35.3867 21.6500 15.6030 8.1855 1.5563 20.0023 30.6384 0.4734 8.4927
temp: 298.150 k
press: 1.00000 atm
elementType: 8 8 7 7 6 6 6 6 6 6 6 6 6 6 6 6 6 6 6 6 1 1 1 1 1 1 1 1 1 1 1 1 1 1 1 1 1 1 1 1 1 1 1 1
symmnumber: 1
zpe: 983689.6 jmol-1
zpe.correction: 0.374668 hartree
zpe.thermalcorrener: 0.394815 hartree
zpe.thermalcorrenthalpy: 0.395759 hartree
zpe.thermalcorrgfe: 0.325803 hartree
zpe.sumelectzpe: -882.506328 hartree
zpe.sumelectthermal: -882.486181 hartree
zpe.sumelectthermalent: -882.485236 hartree
zpe.sumelectthermalfe: -882.555193 hartree
dipole: -1.2809 6.3182 -0.1450
dipole: 6.4484
quadrupole: -114.8289 -137.9118 -111.9595
quadrupole: -4.9115 -0.1043 -0.7986
quadrupole: 6.7378 -16.3450 9.6072 -4.9115 -0.1043 -0.7986
hfenergy: -882.8809956 hartree
pointgroup: C01 [X(C16H24N2O2)]
dipole: -0.7330557 -2.3774361 0.4967094 debye
polarizability: 183.4940702|8.9966634|198.761982|-3.7637846|-7.5708802|183.0950273 unknown
InChI: InChI=1S/C16H24N2O2/c1-12-6-5-7-13(2)15(12)18(10-11-19)16(20)14-8-3-4-9-17-14/h5-7,14,17,19H,3-4,8-11H2,1-2H3
charge 0 multiplicity 1
44 atoms
O  0.557364 2.461326 -0.955254
O  -3.496704 3.486773 -0.02264
N  2.119995 0.430501 1.034769
N  -0.860328 0.737338 -0.327351
C  1.625299 0.316606 -0.36276
C  2.764257 0.695594 -1.338327
C  4.017916 -0.171679 -1.08315
C  4.456289 -0.080189 0.397128
C  3.277568 -0.450158 1.320253
C  0.420647 1.262209 -0.567533
C  -1.116282 -0.644085 0.048256
C  -2.024113 1.600447 -0.670396
C  -1.238145 -1.013755 1.418236
C  -1.285792 -1.606764 -0.995922
C  -2.386226 2.632612 0.423426
C  -1.513687 -2.372271 1.726931
C  -1.568248 -2.947106 -0.645905
C  -1.114352 -0.01258 2.555627
C  -1.14251 -1.20386 -2.45216
C  -1.678981 -3.331835 0.709567
H  1.307036 -0.733101 -0.590577
H  2.992685 1.765826 -1.192953
H  2.410789 0.572345 -2.380353
H  4.840116 0.148726 -1.750626
H  3.796782 -1.231318 -1.331914
H  5.31111 -0.755285 0.595016
H  4.776304 0.953818 0.627161
H  3.034606 -1.534182 1.169263
H  3.561227 -0.315386 2.380538
H  1.366969 0.312464 1.723865
H  -2.889193 0.938326 -0.86585
H  -1.785011 2.165928 -1.589344
H  -1.541503 3.321309 0.574935
H  -2.63217 2.130317 1.38089
H  -1.60296 -2.669273 2.778939
H  -1.696441 -3.692325 -1.439495
H  -2.106981 0.204035 2.995849
H  -0.487971 -0.417167 3.371722
H  -0.688954 0.94896 2.226795
H  -1.834999 -0.386987 -2.725415
H  -0.122167 -0.835358 -2.670398
H  -1.344301 -2.059038 -3.118757
H  -1.893814 -4.374718 0.96765
H  -4.321427 2.941759 -0.091135
