program: Gaussian 09
title: 000135071
version: EM64L-G09RevD.01
frameworkgroup: C1[X(C14H27O6P)]
method: RPBEPBE
basis: SDD
operation: Freq
keyword: #p
keyword: freq=noraman
keyword: PBEPBE/SDD
title: #p freq=noraman PBEPBE/SDD
converged: YES YES NO NO
title: Mulliken charges:
elementType: P O O O O O O C C C C C C C C C C C C C C H H H H H H H H H H H H H H H H H H H H H H H H H H H
charge: 1.382534 -0.519343 -0.281029 -0.676511 -0.685905 -0.588263 -0.253458 -0.383297 -0.386363 -0.379032 -0.371706 -0.383231 -0.365684 -0.377978 -0.406351 -0.270381 -0.284299 0.176783 0.337754 -0.757176 -0.632939 0.193909 0.194879 0.195297 0.196028 0.197007 0.199416 0.194060 0.188738 0.194015 0.197127 0.215936 0.189749 0.221330 0.216160 0.196977 0.213779 0.225162 0.242180 0.225742 0.235659 0.393845 0.402897 0.239602 0.237763 0.215259 0.228084 0.255273
chargesum: 0.00000
title: Mulliken charges with hydrogens summed into heavy atoms:
elementType: P O O O O O O C C C C C C C C C C C C C C
charge: 1.382534 -0.519343 -0.281029 -0.282666 -0.283008 -0.588263 -0.253458 0.005492 0.004963 0.017392 0.011091 0.007912 0.040002 0.059512 0.004404 0.196962 0.177101 0.176783 0.337754 -0.064552 -0.149582
polarizability: 2.66741758e+02 -7.09488386e+00 1.85888976e+02 1.08935478e+01 -2.03682191e+00 1.51484583e+02
1716.lowfreq: -4.8455 -0.0019 -0.0018 -0.0009 3.5819 7.6939 7.8963 12.1265 16.7672
frequency: 7.6933 11.9012 16.7186 21.3279 28.5534 38.4326 46.5388 62.4384 73.6638 74.9868 80.7184 111.7105 114.4520 115.9200 125.8831 141.7565 146.3862 150.4378 162.3978 172.4562 187.1171 212.1277 240.9747 245.4847 279.8756 289.5680 313.5131 318.6254 349.0330 366.1273 378.6637 386.4361 393.8092 401.1564 452.6599 474.6853 482.9305 511.0470 578.9636 634.3987 635.1394 721.0892 722.1188 727.0280 739.1579 742.3583 761.8875 785.2213 792.6852 826.3995 857.8639 869.3013 899.9429 927.1678 946.6349 956.5355 989.7811 989.9533 998.1133 1002.2143 1008.0784 1012.5498 1015.5157 1033.7623 1050.8935 1053.3498 1066.6902 1079.3950 1081.7437 1087.2600 1095.4715 1110.9148 1118.8168 1143.3268 1148.3686 1195.4506 1201.4282 1221.8111 1234.8188 1251.4541 1264.5320 1276.5453 1281.9257 1283.6792 1287.3550 1290.1792 1295.5160 1297.9941 1312.8745 1339.4063 1354.9024 1355.8119 1361.5612 1366.5613 1369.1397 1395.2724 1414.8805 1451.9059 1455.9672 1460.8713 1461.4848 1465.3811 1467.9158 1469.5128 1472.5807 1474.2200 1480.9659 1486.3483 1490.1824 1606.2605 1654.6317 2949.8927 2951.1466 2955.3215 2958.3211 2965.0625 2967.7995 2977.2165 2985.3833 2988.3988 2992.4183 2993.5080 3000.3984 3000.7714 3002.1791 3016.3846 3025.7425 3038.2561 3050.3700 3053.8835 3068.1306 3072.0770 3083.0106 3096.6125 3103.8937 3216.1512 3591.3912 3612.7976
redmass: 5.4611 5.5336 5.0324 4.5185 4.4976 3.0251 2.3037 4.3090 2.6562 5.2727 2.1917 2.0716 5.4297 2.8002 5.3407 2.4657 2.3456 2.1539 1.7874 1.0667 3.2381 2.9998 3.0850 2.8223 3.1363 2.9387 4.6244 3.3252 5.1729 2.7584 1.7424 4.8446 3.6194 4.5786 3.9941 3.5410 3.8364 2.9312 3.6320 1.5547 11.3824 5.0480 1.1937 1.1152 1.1814 8.0949 1.2798 2.0356 1.5071 2.0431 2.1356 1.9931 1.5411 8.6029 1.7211 1.4948 1.4165 3.3621 4.2703 1.3705 1.3915 1.3060 1.2338 2.5283 3.2628 1.5068 2.5905 2.3981 2.1498 2.7555 3.6384 3.9096 4.6746 1.6797 1.3868 1.3413 1.3703 1.2775 1.3562 1.2699 1.2690 1.0940 1.2187 1.1136 1.9140 1.3916 1.1070 1.1260 1.3120 1.3841 1.5177 1.6815 1.4899 1.6718 1.4089 1.1686 1.2471 1.0802 1.0455 1.0745 1.0700 1.0693 1.0824 1.0732 1.0723 1.0923 1.0970 1.0977 1.0953 11.3360 5.1912 1.0589 1.0588 1.0590 1.0595 1.0608 1.0603 1.0614 1.0960 1.0361 1.0976 1.0592 1.0611 1.0600 1.0972 1.0997 1.1012 1.1043 1.1032 1.1037 1.1072 1.0971 1.1083 1.1009 1.0618 1.1156 1.0661 1.0664
irintensity: 0.7942 1.2897 1.1087 0.6072 0.2556 0.1808 0.1613 1.2182 0.7384 0.5718 0.9971 0.3902 1.2905 0.8975 4.3912 2.6235 0.7754 7.6507 70.4068 0.4966 21.0884 7.6917 8.4601 24.0541 12.8076 24.4190 28.5936 3.5844 45.5303 4.4675 93.0194 60.7515 0.6030 20.3278 3.3745 2.7212 1.7301 2.3183 1.8148 8.3978 35.5782 178.4336 81.5190 2.2647 4.1719 188.0521 2.0156 8.7583 2.7978 4.0653 5.4225 1.5469 7.8406 215.0288 0.4418 10.0805 48.7335 33.4214 2.7460 22.7105 16.6102 6.2239 122.5993 10.8126 2.1411 6.2547 37.1511 18.0765 6.1611 92.8782 104.4792 61.6376 402.9919 0.5263 3.9081 13.7167 17.4717 4.5678 0.3414 1.9306 1.9309 1.3814 4.0333 8.0223 61.3970 44.7773 0.2708 3.2620 0.5201 0.1829 0.1764 0.0947 0.7643 0.7204 9.9140 21.7528 10.4036 7.2570 15.7338 0.0372 0.7260 1.0084 0.8362 28.4329 16.2199 4.8910 2.4476 8.9346 29.5440 154.8270 3.4767 2.4491 0.4086 4.9996 3.2479 16.8732 128.0875 57.9055 2.2242 16.5041 2.0671 4.7111 22.6197 51.8622 6.1138 3.3016 3.2183 51.2469 111.8395 54.7376 41.6288 22.0730 62.6125 27.8178 5.4786 5.5261 62.2241 65.9181
temp: 298.150 k
press: 1.00000 atm
elementType: 15 8 8 8 8 8 8 6 6 6 6 6 6 6 6 6 6 6 6 6 6 1 1 1 1 1 1 1 1 1 1 1 1 1 1 1 1 1 1 1 1 1 1 1 1 1 1 1
symmnumber: 1
zpe: 1043539.3 jmol-1
zpe.correction: 0.397463 hartree
zpe.thermalcorrener: 0.424896 hartree
zpe.thermalcorrenthalpy: 0.425840 hartree
zpe.thermalcorrgfe: 0.332139 hartree
zpe.sumelectzpe: -1340.532251 hartree
zpe.sumelectthermal: -1340.504818 hartree
zpe.sumelectthermalent: -1340.503874 hartree
zpe.sumelectthermalfe: -1340.597575 hartree
dipole: 0.1512 -0.3674 4.2533
dipole: 4.2718
quadrupole: -179.2003 -124.9649 -141.7729
quadrupole: -18.5405 18.9861 5.8333
quadrupole: -30.5543 23.6811 6.8732 -18.5405 18.9861 5.8333
hfenergy: -1340.9297141 hartree
pointgroup: C01 [X(C14H27O6P1)]
dipole: -0.0594609 0.2404847 1.6622961 debye
polarizability: 266.7910172|-7.379535|185.9472061|-10.536048|0.0055336|151.3770939 unknown
InChI: InChI=1S/C14H27O6P/c1-13(2)14(15)19-11-9-7-5-3-4-6-8-10-12-20-21(16,17)18/h16-17H,1,3-12H2,2H3
charge 0 multiplicity 1
48 atoms
P  -8.516163 -0.629245 -0.1241
O  -6.876733 -0.655073 -0.573511
O  5.9221 0.177617 0.205566
O  -8.594659 -1.07081 1.557653
O  -8.754249 1.062635 0.049706
O  -9.468814 -1.466728 -1.066913
O  7.963617 0.367916 -0.901693
C  -0.823352 1.062345 0.27643
C  0.559523 0.722747 -0.323722
C  -1.982636 0.286281 -0.387596
C  1.719334 1.498708 0.339871
C  -3.363969 0.621701 0.21891
C  3.10347 1.145259 -0.247727
C  -4.512488 -0.17105 -0.450557
C  4.253314 1.937718 0.412784
C  -5.867412 0.178405 0.161019
C  5.636088 1.601862 -0.145393
C  7.149054 -0.325665 -0.241751
C  7.331394 -1.757965 0.172786
C  6.235259 -2.435072 0.969211
C  8.489702 -2.369715 -0.198817
H  -0.812968 0.845453 1.36525
H  -1.007818 2.152699 0.178521
H  0.744633 -0.367257 -0.224495
H  0.55037 0.937971 -1.412683
H  -1.79604 -0.803625 -0.292982
H  -1.996683 0.506363 -1.475157
H  1.721033 1.291684 1.430681
H  1.539329 2.58917 0.231108
H  -3.346436 0.406341 1.307656
H  -3.552833 1.710488 0.117282
H  3.294835 0.061461 -0.124459
H  3.102081 1.343576 -1.340115
H  -4.541797 0.04702 -1.534759
H  -4.336073 -1.258043 -0.342679
H  4.088075 3.024994 0.265498
H  4.252287 1.761421 1.506393
H  -5.912682 -0.073477 1.238096
H  -6.128947 1.242433 0.021238
H  5.68216 1.703889 -1.245894
H  6.433301 2.229964 0.292597
H  -8.845537 -2.018322 1.706747
H  -9.615736 1.334392 0.453509
H  6.044059 -1.898347 1.915758
H  5.281774 -2.433117 0.410834
H  6.508132 -3.47849 1.201375
H  8.695255 -3.412415 0.066184
H  9.244847 -1.824296 -0.775263
