program: Gaussian 09
title: 000135810
version: EM64L-G09RevD.01
frameworkgroup: C1[X(C16H20F3NO10)]
method: RPBEPBE
basis: SDD
operation: Freq
keyword: #p
keyword: freq=noraman
keyword: PBEPBE/SDD
title: #p freq=noraman PBEPBE/SDD
converged: NO YES NO NO
title: Mulliken charges:
elementType: F F F O O O O O O O O O O N C C C C C C C C C C C C C C C C H H H H H H H H H H H H H H H H H H H H
charge: -0.176951 -0.134892 -0.137332 -0.221520 -0.279181 -0.264670 -0.292976 -0.237225 -0.206319 -0.225946 -0.251042 -0.210371 -0.254071 -0.404487 -0.168377 -0.074383 -0.135100 -0.009899 -0.113988 -0.407188 0.189944 0.302782 0.329104 0.331530 0.285259 -0.756944 -0.779135 0.294442 -0.754300 -0.747507 0.324044 0.320661 0.293997 0.271125 0.340384 0.271690 0.266307 0.364772 0.256907 0.253387 0.254096 0.243003 0.241598 0.295541 0.257974 0.252500 0.247636 0.254327 0.245174 0.255620
chargesum: 0.00000
title: Mulliken charges with hydrogens summed into heavy atoms:
elementType: F F F O O O O O O O O O O N C C C C C C C C C C C C C C C C
charge: -0.176951 -0.134892 -0.137332 -0.221520 -0.279181 -0.264670 -0.292976 -0.237225 -0.206319 -0.225946 -0.251042 -0.210371 -0.254071 -0.039714 0.155667 0.246278 0.158897 0.261226 0.226396 0.130810 0.189944 0.302782 0.329104 0.331530 0.285259 0.007446 0.001006 0.294442 0.003810 0.007614
polarizability: 2.26357183e+02 -4.12665725e+00 2.26404538e+02 2.47783398e+00 2.06538797e+00 1.85550011e+02
1716.lowfreq: -14.3347 -8.3832 -0.0007 -0.0007 0.0004 3.7947 4.2129 11.2273 17.6131
frequency: -14.0115 10.3151 17.4233 19.8789 21.4065 31.0648 32.9404 37.2652 40.6671 46.4379 52.1289 53.9280 59.6242 63.5798 69.8077 79.0291 94.4260 105.6329 125.1941 130.2044 136.7594 171.9137 180.6528 189.9694 200.0477 207.6856 210.3448 234.4043 250.2051 263.7260 280.7453 296.7766 309.6989 323.8951 362.0125 375.4640 383.5750 401.7232 430.0775 442.5685 465.8664 481.6079 484.9529 520.0171 528.2584 533.1342 560.2935 561.1422 567.0019 578.6109 587.8602 599.6200 626.3028 631.4718 635.5729 641.1081 645.0352 712.7532 754.8804 773.5701 814.3569 825.3439 834.0497 849.5452 876.7569 888.8269 891.4076 949.3661 958.5440 965.6299 980.2915 993.7030 998.0354 1004.0666 1008.1086 1015.4930 1032.6494 1038.9271 1042.1702 1042.5420 1045.9333 1050.1821 1063.5628 1076.8804 1091.1111 1122.3594 1141.8554 1165.8402 1179.1388 1180.4430 1190.7583 1205.5670 1226.3020 1248.2541 1253.4631 1269.7861 1277.5956 1294.4856 1307.4412 1320.1388 1334.5725 1348.5552 1361.3275 1363.3800 1384.0003 1384.6467 1386.0525 1386.5886 1392.3918 1441.2727 1451.3124 1451.6376 1452.2966 1452.7613 1453.3459 1453.9677 1455.0135 1460.7622 1498.2946 1646.2392 1649.5157 1660.5104 1667.7201 1687.0523 3006.6275 3007.7485 3008.2714 3009.0234 3020.9404 3033.2728 3035.3300 3053.4914 3069.0999 3096.6771 3098.5235 3100.4794 3101.2635 3102.2305 3129.8298 3142.7416 3143.4115 3145.5373 3145.6640 3526.8362
redmass: 1.0851 12.7611 5.9628 8.6381 9.6607 6.6478 8.3939 3.6751 1.8106 2.9707 2.1577 3.9599 6.6302 4.4535 1.7349 2.7386 4.2506 3.9826 6.0281 6.3941 1.0621 8.0256 9.8826 7.4261 5.5844 7.0445 8.1464 5.2712 8.4373 8.8960 6.5720 5.3445 4.1079 3.2764 4.2607 7.6352 5.0995 4.7450 3.6355 13.6362 5.2011 4.4686 4.9410 4.5982 5.3372 4.0389 3.1513 3.3152 3.6382 3.6604 1.2884 4.2602 5.3959 4.8239 6.0789 4.9865 9.0502 10.9165 4.6392 4.5189 6.0817 6.1848 5.4837 6.8935 4.7224 6.5035 5.4537 4.5122 3.2795 4.1472 2.4757 2.2832 2.1256 3.4949 2.3428 5.1605 2.5799 9.2524 1.6674 1.7474 1.7438 1.6573 4.0663 5.2474 4.8032 3.0879 4.0294 2.9146 3.1362 3.3511 3.0699 3.4711 1.4240 1.4611 1.3321 1.5187 1.4078 1.1954 1.2874 1.4170 1.3408 1.3098 1.4798 1.2265 1.2364 1.2335 1.2442 1.2438 1.3486 1.0935 1.0558 1.0534 1.0549 1.0588 1.0524 1.0473 1.0540 1.0557 1.8792 9.1052 10.2846 9.8160 9.8806 10.1366 1.0374 1.0385 1.0381 1.0369 1.0840 1.0845 1.0849 1.0585 1.0849 1.0971 1.0954 1.0941 1.0883 1.0949 1.1076 1.1022 1.1024 1.1016 1.1011 1.0781
irintensity: 1.1943 0.9774 0.3089 0.0894 0.7240 1.1344 0.2229 1.1818 0.9416 0.1267 3.6651 0.4458 3.2999 2.5036 1.2845 1.1924 4.5215 4.3374 2.4306 1.3290 0.2771 5.0164 0.7196 9.0217 10.7809 6.9930 2.4973 4.3132 3.7665 6.8830 4.8710 6.6714 11.1713 11.9518 5.2039 1.0728 6.4890 12.5765 44.9623 3.1680 16.6821 4.9206 3.5898 6.8382 3.8550 15.7713 10.3866 3.2911 5.6969 10.4775 108.6386 7.9187 3.8317 10.3379 10.0941 3.3946 12.8394 9.5942 11.0755 10.4928 5.3293 44.1870 23.7902 91.4929 95.4509 273.5428 172.2989 49.6938 7.7801 16.4764 56.3638 118.8310 97.3279 11.7826 149.6361 173.7602 13.2156 208.9419 7.3366 48.3665 11.1311 13.4513 50.6091 43.8318 169.3027 18.7879 120.2688 203.0764 304.6428 233.4767 116.3547 341.0124 8.1882 5.7560 43.0392 2.9390 7.4580 28.7752 1.5316 5.5601 4.1615 4.2168 0.6386 15.9038 73.1788 22.0197 73.4305 54.3623 27.5262 19.1892 26.9536 19.0802 9.4991 20.5446 20.0467 23.0471 17.0972 23.3814 193.2218 177.0299 195.3150 172.1229 151.3692 218.8209 5.8790 1.2693 0.6151 0.9506 2.4702 22.8929 2.5761 11.2618 7.5570 5.3096 4.9133 5.9613 4.2512 3.3095 0.3656 8.1843 7.3258 6.9231 9.0960 61.7984
temp: 298.150 k
press: 1.00000 atm
elementType: 9 9 9 8 8 8 8 8 8 8 8 8 8 7 6 6 6 6 6 6 6 6 6 6 6 6 6 6 6 6 1 1 1 1 1 1 1 1 1 1 1 1 1 1 1 1 1 1 1 1
symmnumber: 1
zpe: 948359.9 jmol-1
zpe.correction: 0.361211 hartree
zpe.thermalcorrener: 0.393575 hartree
zpe.thermalcorrenthalpy: 0.394519 hartree
zpe.thermalcorrgfe: 0.289540 hartree
zpe.sumelectzpe: -1725.944392 hartree
zpe.sumelectthermal: -1725.912029 hartree
zpe.sumelectthermalent: -1725.911085 hartree
zpe.sumelectthermalfe: -1726.016064 hartree
dipole: 5.1271 -2.9979 3.0327
dipole: 6.6687
quadrupole: -171.5190 -176.7380 -176.6002
quadrupole: 22.4424 -2.8170 -0.8236
quadrupole: 3.4334 -1.7856 -1.6478 22.4424 -2.8170 -0.8236
hfenergy: -1726.3056035 hartree
pointgroup: C01 [X(C16H20F3N1O10)]
dipole: 1.5115631 2.0132068 -0.738824 debye
polarizability: 223.7989899|3.5979625|226.3751974|-1.6795363|10.5185382|188.1375439 unknown
InChI: InChI=1S/C16H20F3NO10/c1-6(21)26-5-10-12(27-7(2)22)13(28-8(3)23)11(14(30-10)29-9(4)24)20-15(25)16(17,18)19/h10-14,20H,5H2,1-4H3
charge 0 multiplicity 1
50 atoms
F  -4.042578 -0.725773 1.991557
F  -3.862966 -2.984787 2.186065
F  -5.308604 -2.09082 0.687001
O  0.825977 -1.420102 0.507348
O  -1.671761 1.728749 -0.717981
O  1.052392 2.303462 0.110491
O  0.893657 -1.543776 -1.89882
O  3.618039 -0.348113 1.731017
O  -2.822812 -2.963609 -0.611516
O  -1.806225 1.80871 -3.047806
O  0.636783 3.048067 2.286852
O  1.409612 -3.830042 -1.835199
O  4.126661 1.900732 1.365266
N  -2.137413 -0.857288 0.150869
C  -0.544413 0.765938 -0.825749
C  -1.098714 -0.676118 -0.879276
C  0.353885 1.028049 0.390849
C  1.441783 -0.067779 0.542799
C  0.05951 -1.689995 -0.680094
C  2.183594 0.01251 1.884899
C  -2.92636 -1.975898 0.162594
C  -2.223832 2.193125 -1.937393
C  1.161182 3.237474 1.168812
C  1.546623 -2.720063 -2.375609
C  -4.032928 -1.950985 1.254655
C  -3.346885 3.162918 -1.663682
C  2.009847 4.404106 0.742277
C  4.502035 0.711824 1.484309
C  2.367337 -2.382739 -3.596659
C  5.92524 0.20817 1.42254
H  0.013085 0.954554 -1.759022
H  -1.541244 -0.867382 -1.874195
H  -0.235954 1.1343 1.321044
H  2.152186 0.031981 -0.299807
H  -0.289981 -2.729378 -0.584359
H  2.111262 1.017302 2.330584
H  1.779206 -0.746436 2.571803
H  -2.363375 -0.070536 0.766105
H  -3.053977 3.886884 -0.886095
H  -3.618712 3.685929 -2.591674
H  -4.230825 2.615159 -1.289517
H  1.825603 4.668546 -0.310781
H  1.821245 5.266035 1.398892
H  3.067865 4.098189 0.839286
H  1.70906 -2.011956 -4.401704
H  2.904236 -3.277784 -3.9412
H  3.085632 -1.577801 -3.364831
H  5.970712 -0.778334 0.935285
H  6.556432 0.93488 0.890232
H  6.315574 0.090401 2.450036
