program: Gaussian 09
title: 000134960
version: EM64L-G09RevD.01
frameworkgroup: C1[X(C12H9N3O4)]
method: RPBEPBE
basis: SDD
operation: Freq
keyword: #p
keyword: freq=noraman
keyword: PBEPBE/SDD
title: #p freq=noraman PBEPBE/SDD
converged: YES YES NO NO
title: Mulliken charges:
elementType: O O O O N N N C C C C C C C C C C C C H H H H H H H H H
charge: -0.198417 -0.189607 -0.171342 -0.209961 -0.266310 -0.352734 0.055354 -0.111323 -0.443653 -0.484940 0.164174 0.129285 0.173360 0.157400 0.244572 -0.201513 -0.268180 -0.139007 -0.336953 0.288265 0.271535 0.240211 0.264389 0.248907 0.356849 0.278479 0.242681 0.258480
chargesum: 0.00000
title: Mulliken charges with hydrogens summed into heavy atoms:
elementType: O O O O N N N C C C C C C C C C C C C
charge: -0.198417 -0.189607 -0.171342 -0.209961 -0.266310 0.004115 0.055354 0.176942 0.068092 0.028355 0.164174 0.129285 0.173360 0.157400 0.244572 -0.201513 0.010299 0.103675 -0.078473
polarizability: 2.33237965e+02 -1.10744654e+00 1.44577495e+02 1.30411145e+01 3.60597259e+00 9.75485979e+01
1716.lowfreq: -11.4817 -6.5273 -3.3192 -0.0007 -0.0004 0.0004 32.9187 41.2521 51.9298
frequency: 32.8971 41.2280 51.9210 113.4326 129.4960 135.8202 148.9501 186.4588 208.4919 212.1810 255.2772 335.2963 349.7631 370.4458 388.9003 418.7188 433.9421 452.8312 507.8433 522.1609 542.3080 570.9563 585.3032 632.6017 667.5450 673.2271 698.2877 721.4069 742.9029 756.6053 808.3214 811.0327 831.4728 840.1639 881.8931 893.1601 956.1612 982.9078 994.3788 999.8006 1028.5346 1047.3961 1062.9095 1094.5780 1095.1996 1162.2687 1172.3730 1195.7639 1214.8809 1262.5742 1277.0394 1294.1429 1309.4120 1324.6435 1328.9714 1344.6449 1355.2931 1366.8266 1379.0341 1400.4376 1444.3390 1446.9043 1483.1455 1567.9710 1596.9112 1636.9620 1645.2884 1649.2791 1689.9285 2972.1251 2990.7271 3023.8909 3083.8718 3090.7893 3148.7304 3162.1816 3180.7998 3481.3893
redmass: 7.1813 8.9131 6.0649 5.6000 6.5429 7.2028 8.9327 6.9407 4.9532 2.8341 7.9200 11.2446 9.7444 5.0178 4.2401 4.8574 4.2372 4.6520 5.9430 7.6366 4.5982 4.2437 7.8810 4.0156 7.8698 5.1418 6.7484 4.8135 3.1743 4.2711 3.2274 1.3761 2.0032 2.9669 4.9978 2.7154 1.4031 2.4209 3.2050 1.4058 2.7637 2.5802 2.9660 2.5841 3.1145 1.5342 1.5244 1.8343 3.6520 1.9226 2.0312 2.6658 1.8998 1.3993 1.7305 4.2152 4.6858 1.7488 1.7460 2.5352 2.1463 1.0828 1.0836 7.7408 7.5348 11.6986 11.7228 5.9314 12.3258 1.0810 1.0680 1.0604 1.0984 1.1000 1.0889 1.0927 1.1000 1.0760
irintensity: 0.3437 0.8862 3.7903 3.8765 0.4699 5.8275 6.6410 0.7464 1.3629 0.4470 1.8468 21.7898 6.9395 11.3729 2.7268 1.7138 0.3168 29.7664 4.1924 3.8622 21.1746 1.5590 24.0847 4.6923 3.4774 5.1757 3.5862 40.1050 2.6209 4.2859 16.1513 104.2630 18.0629 2.3093 10.4934 15.5319 0.0263 17.0599 13.8279 0.3430 28.3698 9.2754 30.5637 21.8044 20.4023 11.9170 8.8215 216.6054 0.3888 204.3018 4.8767 73.0161 63.6756 8.3041 48.4369 189.1628 69.1541 63.8518 8.7794 9.2099 9.3943 12.1858 10.4527 28.0115 14.3241 393.6207 176.6810 425.0785 36.0914 21.6466 8.5242 16.3466 7.8366 6.1040 4.9580 5.0874 16.3832 43.2585
temp: 298.150 k
press: 1.00000 atm
elementType: 8 8 8 8 7 7 7 6 6 6 6 6 6 6 6 6 6 6 6 1 1 1 1 1 1 1 1 1
symmnumber: 1
zpe: 525750.7 jmol-1
zpe.correction: 0.200248 hartree
zpe.thermalcorrener: 0.215403 hartree
zpe.thermalcorrenthalpy: 0.216347 hartree
zpe.thermalcorrgfe: 0.156721 hartree
zpe.sumelectzpe: -926.535633 hartree
zpe.sumelectthermal: -926.520478 hartree
zpe.sumelectthermalent: -926.519534 hartree
zpe.sumelectthermalfe: -926.579161 hartree
dipole: 3.4308 -1.3508 -2.9199
dipole: 4.7033
quadrupole: -102.4891 -118.3754 -109.0121
quadrupole: -18.6161 -0.3610 -2.7611
quadrupole: 7.4698 -8.4165 0.9468 -18.6161 -0.3610 -2.7611
hfenergy: -926.7358812 hartree
pointgroup: C01 [X(C12H9N3O4)]
dipole: 1.3478978 0.7028105 1.0551241 debye
polarizability: 233.0761816|0.3331075|144.6542599|-13.8686081|-3.1895729|97.6336164 unknown
InChI: InChI=1S/C12H9N3O4/c16-8-4-3-7(10(17)14-8)15-11(18)6-2-1-5-13-9(6)12(15)19/h1-2,5,7,14H,3-4H2
charge 0 multiplicity 1
28 atoms
O  -1.317308 0.242339 -2.117746
O  0.028657 2.070386 0.302212
O  0.827506 -2.564387 0.089554
O  -5.433482 0.371924 0.010578
N  0.101864 -0.307876 0.233645
N  -3.342434 0.280276 -0.983547
N  3.633049 -1.176262 -0.020602
C  -1.332834 -0.584156 0.213651
C  -2.066225 -0.123063 1.494924
C  -3.567728 -0.457115 1.385877
C  -1.96119 0.020841 -1.064125
C  0.672999 0.996461 0.225562
C  1.088359 -1.343509 0.122749
C  -4.212419 0.097835 0.1212
C  2.148697 0.779752 0.126679
C  2.407055 -0.612228 0.07016
C  3.217567 1.688187 0.083895
C  4.515503 1.126592 -0.01563
C  4.674197 -0.282833 -0.062853
H  -1.415014 -1.68852 0.122532
H  -1.919883 0.962448 1.632398
H  -1.627573 -0.637668 2.367349
H  -4.136391 -0.061194 2.24312
H  -3.72173 -1.555446 1.38385
H  -3.775958 0.655724 -1.837052
H  3.049889 2.768681 0.121786
H  5.401348 1.767058 -0.057825
H  5.672581 -0.726247 -0.139039
