program: Gaussian 09
title: 000134972
version: EM64L-G09RevD.01
frameworkgroup: C1[X(C21H30O3)]
method: RPBEPBE
basis: SDD
operation: Freq
keyword: #pfreq=noraman
keyword: PBEPBE/SDD
title: #p freq=noraman PBEPBE/SDD
converged: YES YES NO NO
title: Mulliken charges:
elementType: O O O C C C C C C C C C C C C C C C C C C C C C H H H H H H H H H H H H H H H H H H H H H H H H H H H H H H
charge: -0.223683 -0.222491 -0.427936 0.410148 -0.110634 -0.099244 -0.342786 0.235005 -0.226255 -0.532264 -0.532803 -0.538821 -0.471371 -0.848065 0.550992 -0.501643 0.153120 -0.808151 -0.612332 -0.679276 0.149416 -0.474931 -0.066367 -0.770877 0.212601 0.209901 0.256886 0.241850 0.187203 0.249653 0.222709 0.218345 0.258182 0.229262 0.218877 0.210927 0.225825 0.263904 0.216935 0.216671 0.224682 0.232337 0.231468 0.218266 0.255490 0.257850 0.211386 0.190189 0.235414 0.240649 0.240901 0.236508 0.252762 0.323619
chargesum: 0.00000
title: Mulliken charges with hydrogens summed into heavy atoms:
elementType: O O O C C C C C C C C C C C C C C C C C C C C C
charge: -0.223683 -0.222491 -0.104317 0.410148 0.101967 0.110657 -0.085900 0.235005 0.015595 -0.095408 -0.091749 -0.051378 -0.041567 -0.141401 0.550992 -0.060290 0.153120 -0.126079 -0.356842 -0.210040 0.149416 -0.049329 0.174281 -0.040707
polarizability: 2.92538075e+02 -1.76258583e+01 2.20537557e+02 5.67580087e+00 -5.78741070e+00 1.66890798e+02
1716.lowfreq: -5.0770 -0.0010 -0.0007 0.0006 5.3247 13.3363 30.4130 45.2172 56.5111
frequency: 29.3701 44.9340 56.4882 62.8360 83.7100 88.9860 97.1077 119.2564 156.6484 177.5798 182.6707 188.2992 199.0144 215.3224 228.8112 243.9445 255.9652 270.6072 278.1174 286.0527 300.2899 305.0904 325.1619 333.3853 337.1119 354.3531 394.7619 405.8290 429.3743 437.6729 448.5800 463.8296 480.4267 518.5070 523.9028 540.1907 562.5771 588.3856 604.1910 626.7298 631.3202 664.1956 687.2880 709.1998 735.7735 798.5684 819.2878 825.5201 834.0657 852.8910 868.8668 875.1546 901.6302 912.0255 927.1627 931.7981 939.6929 943.2865 958.9914 963.4670 981.8191 991.8055 1005.5941 1013.3919 1020.1048 1025.4197 1030.9450 1037.1531 1051.6757 1072.8951 1079.1257 1092.0445 1118.2234 1121.5162 1132.7274 1137.3341 1144.4019 1149.4772 1161.9852 1175.2793 1181.2926 1190.8495 1196.3792 1204.9219 1213.6421 1223.7692 1242.1785 1243.7203 1246.6635 1252.2076 1265.7713 1272.0618 1280.0889 1288.6069 1295.4771 1299.9213 1307.2021 1323.5417 1326.8429 1330.0768 1338.4444 1339.4116 1347.9301 1349.3258 1360.3490 1364.1115 1365.9560 1377.7129 1388.9991 1391.8938 1440.5516 1451.1560 1452.5654 1459.8168 1462.8166 1470.3567 1471.3285 1475.3543 1482.0031 1484.2219 1488.4858 1495.3761 1497.4673 1570.0204 1616.1936 1630.9157 2913.2625 2926.0556 2927.0545 2943.9601 2951.0219 2957.7424 2966.4123 2971.3670 2979.9867 2987.2385 2992.5448 2995.8974 2996.3640 3010.7529 3035.4126 3040.9164 3045.6761 3050.6312 3053.0128 3056.7981 3061.8599 3064.7659 3079.0049 3079.8636 3083.3972 3096.4800 3108.3221 3118.5393 3121.7564 3541.8048
redmass: 4.3941 3.8006 3.0928 5.4235 3.5635 2.4209 1.6068 1.8278 4.0516 1.7894 1.8195 2.6374 4.3641 1.9547 1.7897 2.3379 2.4441 2.9523 2.8819 2.9972 2.3169 1.5546 2.6971 2.9963 2.6933 3.7169 3.6297 2.8655 3.9757 3.5396 1.8780 3.2685 3.4576 3.6609 2.4786 2.9783 3.5993 3.4648 3.2559 3.0964 3.5526 2.8445 4.3292 2.4774 2.6636 2.0289 2.3064 2.3391 1.6622 2.3051 1.7637 2.0702 1.7319 1.9321 2.1581 1.8996 1.9284 2.1517 2.3170 1.9681 2.3607 1.9157 2.1913 2.5270 2.1515 1.8425 1.8192 1.8869 2.1192 2.2472 2.0258 2.3259 2.2709 1.5229 2.1063 2.2349 1.9053 1.5279 1.6957 2.3705 1.9597 2.0034 1.9236 1.2984 1.6930 1.8630 1.4174 1.3536 1.2908 1.4728 1.8646 1.5013 1.8434 1.5727 1.5283 1.5440 1.4257 1.3623 1.6138 1.4090 1.4079 1.5200 1.6387 1.4419 1.4133 1.2832 1.4111 1.2280 1.2325 1.2033 1.0780 1.0536 1.0859 1.0736 1.0696 1.0903 1.0809 1.0821 1.0670 1.0824 1.0536 1.0671 1.0623 10.4311 8.0607 8.1848 1.0802 1.0795 1.0813 1.0663 1.0812 1.0672 1.0674 1.0613 1.0369 1.0359 1.0451 1.0619 1.0524 1.0672 1.0869 1.0964 1.0945 1.0953 1.0999 1.1020 1.0953 1.0961 1.0980 1.0977 1.0992 1.0989 1.0961 1.1004 1.0912 1.0658
irintensity: 1.8423 2.1706 0.2385 5.9421 0.9448 2.3092 1.4193 0.6748 0.8147 2.3053 0.5684 2.7445 1.0791 0.4266 5.2182 0.8377 3.1557 2.1893 1.0599 2.6443 6.1665 44.1521 22.9414 14.8253 32.8995 12.1617 2.5728 0.4432 2.9383 2.7043 2.8123 2.7596 1.2738 2.1893 0.7783 1.2492 4.4185 11.9349 4.4191 6.9183 8.3615 3.1054 0.4259 3.5766 0.5134 4.8940 1.6100 4.5682 1.0539 10.3258 5.6212 2.8785 11.6038 12.2701 2.5288 17.1599 8.5239 14.5343 0.4250 33.3642 63.7994 1.7241 30.9568 47.2379 14.5967 12.0159 11.1465 6.4492 2.2263 1.4613 9.7222 0.1901 16.3352 2.7762 2.6391 4.0561 5.2276 5.0890 31.9612 13.0864 3.4526 4.4506 70.7039 24.1885 0.5072 5.7700 3.1694 1.3900 9.5122 2.5276 46.5799 19.9575 91.9160 11.4961 15.5172 1.7904 0.1845 9.6654 6.1089 1.7399 2.7943 5.1383 5.7400 0.5130 14.5819 30.2174 54.8688 32.5336 9.3617 36.6747 25.0050 21.4466 15.6851 1.7763 3.6909 11.4493 5.5315 2.4682 32.7137 5.3392 2.2022 7.8709 6.7687 152.5924 93.7939 134.8864 9.6792 13.6256 5.8602 19.3437 12.9707 55.1777 17.4997 41.5475 2.6073 22.9610 14.6692 20.6738 47.1607 44.6103 8.7217 13.5436 54.0895 37.1114 22.1837 24.4247 38.4399 18.4139 81.4080 0.9029 25.0992 13.5637 16.4521 18.9004 12.9640 10.3354
temp: 298.150 k
press: 1.00000 atm
elementType: 8 8 8 6 6 6 6 6 6 6 6 6 6 6 6 6 6 6 6 6 6 6 6 6 1 1 1 1 1 1 1 1 1 1 1 1 1 1 1 1 1 1 1 1 1 1 1 1 1 1 1 1 1 1
symmnumber: 1
zpe: 1223092.3 jmol-1
zpe.correction: 0.465851 hartree
zpe.thermalcorrener: 0.489312 hartree
zpe.thermalcorrenthalpy: 0.490256 hartree
zpe.thermalcorrgfe: 0.414532 hartree
zpe.sumelectzpe: -1042.050398 hartree
zpe.sumelectthermal: -1042.026937 hartree
zpe.sumelectthermalent: -1042.025993 hartree
zpe.sumelectthermalfe: -1042.101717 hartree
dipole: 0.6313 -1.5793 1.0686
dipole: 2.0086
quadrupole: -147.9042 -164.0365 -141.5323
quadrupole: -16.7637 15.9974 2.2920
quadrupole: 3.2535 -12.8789 9.6254 -16.7637 15.9974 2.2920
hfenergy: -1042.5162491 hartree
pointgroup: C01 [X(C21H30O3)]
dipole: 0.2423042 -0.6298272 0.4112286 debye
polarizability: 292.1069986|-18.6846187|221.1627644|4.6663984|-5.0799071|166.696667 unknown
InChI: InChI=1S/C21H30O3/c1-12(22)15-4-5-16-19-17(7-9-21(15,16)3)20(2)8-6-14(23)10-13(20)11-18(19)24/h11,14-17,19,23H,4-10H2,1-3H3
charge 0 multiplicity 1
54 atoms
O  0.241843 3.198884 -0.254584
O  -4.807888 -2.056176 0.147582
O  6.49752 -0.392902 -0.520795
C  -2.338365 -0.391099 0.128243
C  -1.517384 0.912201 -0.145645
C  0.656593 -0.438085 -0.255539
C  -0.059858 0.820988 0.350936
C  2.126185 -0.611771 0.288309
C  -3.714204 0.057488 -0.452753
C  -1.659006 -1.561943 -0.614904
C  -0.194777 -1.735124 -0.138754
C  -2.442387 2.046767 0.371128
C  -3.894582 1.529547 0.079963
C  -2.474558 -0.704445 1.645085
C  2.882874 0.724923 0.184416
C  2.861472 -1.68299 -0.593288
C  0.767207 2.071958 0.008888
C  2.14488 -1.062865 1.784213
C  2.234809 1.921128 0.025149
C  4.399676 0.689052 0.280711
C  -4.918165 -0.864226 -0.254081
C  4.393774 -1.745699 -0.398768
C  5.031865 -0.370778 -0.655076
C  -6.285534 -0.287809 -0.613214
H  -1.461525 1.021905 -1.253197
H  0.758866 -0.224418 -1.34466
H  -0.05761 0.742824 1.460627
H  -3.595245 0.12754 -1.560279
H  -1.670379 -1.355235 -1.706537
H  -2.221036 -2.499973 -0.454397
H  -0.201084 -2.094058 0.907079
H  0.278772 -2.534513 -0.739207
H  -2.221164 3.002619 -0.124799
H  -2.293601 2.205265 1.455573
H  -4.507844 1.540429 1.000179
H  -4.4136 2.163217 -0.660755
H  -3.016512 0.094046 2.182459
H  -3.034815 -1.64465 1.77929
H  -1.492477 -0.817055 2.135433
H  2.651205 -1.460439 -1.659911
H  2.42887 -2.678551 -0.3845
H  1.56341 -0.373447 2.421538
H  1.720802 -2.076429 1.894144
H  3.173673 -1.091238 2.183353
H  2.802815 2.853879 -0.085909
H  4.826375 1.68319 0.060812
H  4.697228 0.432496 1.321885
H  4.640807 -2.075759 0.632421
H  4.832401 -2.489915 -1.088888
H  4.879126 -0.076237 -1.708824
H  -6.585375 0.469025 0.136777
H  -6.256168 0.227329 -1.591328
H  -7.039035 -1.090601 -0.631962
H  6.726431 -0.686067 0.398862
