program: Gaussian 09
title: 000011677
version: EM64L-G09RevD.01
frameworkgroup: C1[X(C3HCl7)]
method: RPBEPBE
basis: SDD
operation: Freq
keyword: #pfreq=noraman
keyword: PBEPBE/SDD
title: #p freq=noraman PBEPBE/SDD
converged: YES YES YES YES
title: Mulliken charges:
elementType: Cl Cl Cl Cl Cl Cl Cl C C C H
charge: 0.151986 0.137118 0.175848 0.174023 0.129511 0.098477 0.084319 -0.242764 -0.553888 -0.518494 0.363863
chargesum: 0.00000
title: Mulliken charges with hydrogens summed into heavy atoms:
elementType: Cl Cl Cl Cl Cl Cl Cl C C C
charge: 0.151986 0.137118 0.175848 0.174023 0.129511 0.098477 0.084319 -0.242764 -0.553888 -0.154631
polarizability: 9.18257931e+01 2.12531763e-01 1.08985361e+02 -5.11955943e-01 6.53533085e+00 9.22167712e+01
1716.lowfreq: 0.0033 0.0033 0.0035 5.5100 8.0538 9.2332 46.3376 76.6419 127.3825
frequency: 46.3165 76.6344 127.3811 159.8348 169.6890 180.7766 204.3056 215.0005 221.3991 248.7660 264.2535 302.2935 320.6153 334.5886 371.2802 538.4978 612.9599 670.6796 692.8720 705.2637 770.2154 784.7696 944.2237 1035.1956 1184.8132 1254.4964 3142.0549
redmass: 26.3814 32.0488 31.4228 33.4205 30.1981 30.9142 33.0093 29.9268 31.9437 28.6125 28.1407 29.2664 24.0481 29.9252 31.7556 9.1981 11.3558 12.3825 11.7968 10.2287 7.6904 9.7717 11.1292 9.6057 1.0797 1.1409 1.0871
irintensity: 0.2110 0.1152 0.3490 0.1436 0.6699 0.2947 0.0559 0.2084 0.0485 0.0993 0.3008 0.3489 2.5855 1.4158 0.9682 50.2831 75.9600 138.5783 120.6844 65.8153 18.4916 41.9696 10.8429 11.6818 3.8981 2.2755 0.8916
temp: 298.150 k
press: 1.00000 atm
elementType: 17 17 17 17 17 17 17 6 6 6 1
symmnumber: 1
zpe: 93184.2 jmol-1
zpe.correction: 0.035492 hartree
zpe.thermalcorrener: 0.047543 hartree
zpe.thermalcorrenthalpy: 0.048487 hartree
zpe.thermalcorrgfe: -0.004527 hartree
zpe.sumelectzpe: -3334.514480 hartree
zpe.sumelectthermal: -3334.502429 hartree
zpe.sumelectthermalent: -3334.501485 hartree
zpe.sumelectthermalfe: -3334.554499 hartree
dipole: 0.3182 0.0468 -0.8625
dipole: 0.9205
quadrupole: -109.2577 -106.1114 -103.0488
quadrupole: 0.0873 1.2728 0.3786
quadrupole: -3.1184 0.0279 3.0905 0.0873 1.2728 0.3786
hfenergy: -3334.5499721 hartree
pointgroup: C01 [X(C3H1Cl7)]
dipole: 0.1284708 -0.0187791 0.3380624 debye
dipolederiv: -0.1336891 0.0126407 -0.1127996 0.0173104 -0.0759468 0.0375772 -0.0818453 -0.0036477 -0.5628976 -0.1690492 -0.0203532 0.0012309 -0.0298951 -0.543926 -0.2306026 0.0092932 -0.1540618 -0.2071056 -0.4478069 -0.2667401 0.1509048 -0.2473759 -0.3299389 0.1302091 0.138379 0.1252851 -0.1594151 -0.139707 0.1034349 0.0435275 0.0327515 -0.5307073 -0.234452 0.0056499 -0.2305798 -0.2209567 -0.2056305 0.0295558 -0.082075 0.0195254 -0.1364534 0.1065046 0.0022681 0.108558 -0.7355206 -0.5107319 0.2283337 0.0112855 0.1766725 -0.2609509 0.0102684 -0.0282103 0.0356968 -0.0523767 -0.1513188 -0.0898533 0.0052803 0.0142579 -0.6063425 -0.0315523 0.0322057 -0.0850029 -0.0667316 0.2574219 0.0029671 0.1571938 -0.0014988 0.4670135 0.2337684 0.0647823 0.1532359 0.807539 0.7695744 0.1291595 -0.0815373 0.1466397 1.0515057 -0.0047422 -0.1359443 -0.0150135 1.1286484 0.6962585 -0.1240867 -0.0613502 -0.1221494 0.9896409 -0.0113093 -0.0027273 0.0687927 0.0315053 0.0346787 -0.0050585 -0.0316607 -0.006238 -0.0238943 -0.0056693 -0.003851 -0.003263 0.0373112 unknown
polarizability: 91.8349808|-0.022314|109.0080043|0.5627614|6.5056679|92.1849405 unknown
InChI: InChI=1S/C3HCl7/c4-1(5)2(6,7)3(8,9)10/h1H
charge 0 multiplicity 1
11 atoms
Cl -0.51158 0.545724 -1.985318
Cl -0.15767 2.161735 0.564085
Cl 2.566303 0.954889 -0.536365
Cl 1.49534 -1.805344 -0.819088
Cl 1.485881 -0.487195 1.896063
Cl -2.981754 0.617489 0.255129
Cl -1.61343 -2.059969 0.112289
C  -0.195523 0.420716 -0.166542
C  1.240818 -0.198076 0.063666
C  -1.381576 -0.277418 0.566818
H  -1.215708 -0.247652 1.650863
