program: Gaussian 09
title: 000134898
version: EM64L-G09RevD.01
frameworkgroup: C1[X(C17H20FN3O4)]
method: RPBEPBE
basis: SDD
operation: Freq
keyword: #p
keyword: freq=noraman
keyword: PBEPBE/SDD
title: #p freq=noraman PBEPBE/SDD
converged: YES YES NO NO
title: Mulliken charges:
elementType: F O O O O N N N C C C C C C C C C C C C C C C C C H H H H H H H H H H H H H H H H H H H H
charge: -0.202170 -0.373826 -0.195463 -0.384359 -0.251665 -0.161402 -0.208831 -0.065282 -0.389891 -0.391081 -0.371651 -0.376497 0.295374 0.463143 -0.522330 0.207619 -0.321105 0.187464 -0.270382 -0.557940 -0.614160 0.020848 0.141674 -0.701822 0.093317 0.253063 0.226971 0.231315 0.219357 0.198747 0.217885 0.219231 0.189409 0.303110 0.239034 0.254188 0.329468 0.305438 0.192003 0.225983 0.228012 0.229681 0.266254 0.236224 0.385046
chargesum: 0.00000
title: Mulliken charges with hydrogens summed into heavy atoms:
elementType: F O O O O N N N C C C C C C C C C C C C C C C C C
charge: -0.202170 -0.373826 -0.195463 0.000687 -0.251665 -0.161402 -0.208831 -0.065282 0.090143 0.059591 0.044981 0.032143 0.295374 0.463143 -0.219221 0.207619 0.172117 0.187464 0.059087 -0.252502 0.031838 0.020848 0.141674 0.030337 0.093317
polarizability: 3.77152969e+02 1.78858601e+01 2.35979106e+02 -7.64166018e+00 -8.93627066e+00 1.36442742e+02
1716.lowfreq: -10.2931 -4.9170 -3.4440 0.0004 0.0008 0.0011 14.7251 31.8261 41.2250
frequency: 13.0433 31.6601 41.2158 44.2352 58.3882 76.8930 95.9479 105.9969 109.9783 153.9453 156.9554 182.9230 194.9699 216.1076 225.9910 231.0381 241.3216 265.6815 276.2447 283.2086 291.3718 297.8300 320.5929 323.2751 334.6768 366.2937 381.0386 392.5308 408.0095 437.4913 456.3618 476.6457 491.3535 496.7005 539.8114 549.2816 567.6697 582.3665 617.3021 631.3968 642.9654 668.4295 693.2541 705.4771 722.9040 740.6730 757.8782 777.2883 783.1046 798.8116 838.4173 842.6484 860.2398 869.8878 901.6484 912.6835 936.9961 939.6558 999.7485 1004.1216 1015.1140 1022.6744 1049.4795 1066.2525 1070.7428 1077.7028 1089.4401 1102.9370 1118.4015 1127.0936 1144.8886 1150.1388 1160.8564 1195.3695 1203.3374 1215.3874 1237.4088 1241.9695 1257.0515 1284.3562 1289.7838 1295.6340 1310.2735 1340.1400 1347.5524 1350.0524 1354.0970 1367.9646 1374.9268 1379.8162 1386.4521 1392.3004 1431.8826 1440.9002 1451.4606 1456.2037 1457.5640 1462.3790 1465.8840 1472.9389 1474.3334 1481.1730 1493.1172 1511.7616 1543.8013 1555.2726 1604.4887 1621.6961 1639.2919 2842.8763 2857.9630 2872.6782 2945.8569 2955.8163 2996.4220 3016.4800 3024.7782 3032.1409 3040.1052 3063.9321 3082.1601 3086.6200 3097.4282 3112.3616 3131.7716 3168.4213 3178.6162 3225.9887 3507.4277
redmass: 4.8956 5.3266 7.7750 3.8301 8.0834 4.4675 3.4180 2.8953 4.7943 6.2124 3.4232 3.5619 5.4484 3.9156 1.2853 1.8087 2.5918 2.5106 6.2834 4.6934 3.6280 3.6557 3.2433 4.7267 3.3318 3.6221 2.7492 3.9001 5.7326 5.8469 3.7000 2.7640 4.1423 3.9230 3.8984 4.8157 4.8715 1.6703 2.9440 3.9499 5.5298 3.6759 4.9534 3.9999 5.1376 6.1997 3.6005 2.4357 3.0363 3.2287 2.8673 1.8486 1.6695 1.6093 3.7025 1.4349 2.0770 3.7247 1.9579 2.3979 3.3949 3.3606 1.6649 2.2661 1.9021 1.7642 2.4168 2.0058 2.3681 1.6552 3.1717 2.8222 2.3022 1.8900 1.2592 2.3000 2.4148 1.6497 1.6162 1.2529 1.5245 1.4342 1.6674 1.9919 1.3521 1.3787 1.7931 2.0238 1.5840 2.1557 1.2577 2.3272 1.1728 1.1091 2.3782 1.0784 1.2527 1.1272 1.2707 1.0502 1.1040 1.0535 1.0524 4.5577 9.4843 10.2230 8.7639 8.7238 8.3733 1.0704 1.0656 1.0605 1.0667 1.0712 1.0355 1.0605 1.0741 1.0884 1.0900 1.0942 1.1011 1.1019 1.0990 1.1034 1.0905 1.0920 1.0905 1.0931 1.0639
irintensity: 0.2792 2.8253 1.2946 0.7329 1.2289 6.3578 4.4681 2.9787 6.9216 1.4372 4.9431 0.6651 2.3869 3.4081 1.1330 9.3310 0.8738 6.6425 5.1767 5.9003 12.4816 3.6590 6.8089 27.8990 0.7495 4.6080 12.2689 0.7094 4.1310 0.2329 5.4015 3.4035 44.9288 6.0211 15.0736 15.4250 47.1712 82.9441 33.1210 50.9336 5.7271 24.9893 15.3480 9.4941 32.2989 13.3609 16.2346 7.0301 17.4808 24.4132 21.7894 4.4255 5.4417 24.8337 28.9838 22.9779 3.5641 5.7121 55.5521 71.2913 3.3866 92.3455 3.2164 42.0272 35.6421 7.2698 93.6333 36.4610 42.6813 11.9527 19.5646 51.5220 27.0945 40.4341 12.8584 19.1397 63.1788 0.8093 287.6498 13.1238 37.6856 69.2786 45.7629 7.0880 3.4249 1.1701 49.4948 68.1222 11.3157 87.0983 32.5089 87.9560 2.2760 3.0512 30.8897 0.6208 54.0074 31.0558 73.3005 17.7810 14.5911 10.0150 9.4075 279.4202 80.7961 70.0848 290.9753 288.2595 291.2542 56.7141 42.4949 209.5046 36.0351 70.9580 21.7025 13.5803 45.6128 43.2927 49.0041 22.1471 29.5873 5.8564 7.2890 12.0201 4.4393 6.1562 2.7716 5.7703 41.7441
temp: 298.150 k
press: 1.00000 atm
elementType: 9 8 8 8 8 7 7 7 6 6 6 6 6 6 6 6 6 6 6 6 6 6 6 6 6 1 1 1 1 1 1 1 1 1 1 1 1 1 1 1 1 1 1 1 1
symmnumber: 1
zpe: 922250.0 jmol-1
zpe.correction: 0.351266 hartree
zpe.thermalcorrener: 0.374987 hartree
zpe.thermalcorrenthalpy: 0.375931 hartree
zpe.thermalcorrgfe: 0.296983 hartree
zpe.sumelectzpe: -1222.826244 hartree
zpe.sumelectthermal: -1222.802523 hartree
zpe.sumelectthermalent: -1222.801579 hartree
zpe.sumelectthermalfe: -1222.880527 hartree
dipole: 6.2197 2.7810 2.2629
dipole: 7.1791
quadrupole: -134.8833 -148.7409 -151.4456
quadrupole: 1.8772 0.2380 14.6543
quadrupole: 10.1400 -3.7177 -6.4223 1.8772 0.2380 14.6543
hfenergy: -1223.17751 hartree
pointgroup: C01 [X(C17H20F1N3O4)]
dipole: -2.4391167 1.037897 -0.9752625 debye
polarizability: 377.1495369|-18.6399746|236.7947131|-4.9791345|2.2128364|135.6305669 unknown
InChI: InChI=1S/C17H20FN3O4/c1-3-21(25)10-12(17(23)24)16(22)11-8-13(18)14(9-15(11)21)20-6-4-19(2)5-7-20/h8-10,23H,3-7H2,1-2H3
charge 0 multiplicity 1
45 atoms
F  -1.966553 -2.786513 -0.459679
O  1.537103 2.215952 1.277871
O  3.130712 -2.521158 -0.562706
O  5.377853 -1.709413 0.953515
O  5.940033 0.479771 0.435057
N  -2.90794 -0.130964 0.155189
N  1.774362 1.449755 0.055005
N  -5.728212 0.477543 0.376472
C  -3.838414 -1.042004 0.878395
C  -3.380301 1.27185 0.13989
C  -5.26273 -0.92734 0.31564
C  -4.82116 1.347049 -0.401815
C  -1.548101 -0.412734 0.027211
C  0.80772 0.302293 -0.024551
C  -0.550837 0.605459 0.128074
C  1.280487 -1.014189 -0.223417
C  1.610696 2.351077 -1.207583
C  -1.044991 -1.731734 -0.251679
C  3.174707 1.043149 0.241361
C  0.304252 -2.038366 -0.349627
C  -7.139873 0.626569 -0.027541
C  2.725425 -1.365865 -0.229719
C  3.627755 -0.249493 0.17714
C  2.51183 3.584595 -1.150368
C  5.074811 -0.430259 0.505712
H  -3.487117 -2.078647 0.797116
H  -3.853817 -0.753836 1.951551
H  -3.347637 1.710124 1.161106
H  -2.729169 1.869195 -0.5208
H  -5.276235 -1.325167 -0.731352
H  -5.93827 -1.553386 0.92711
H  -5.171723 2.393026 -0.323787
H  -4.811368 1.068181 -1.487973
H  -0.815978 1.621852 0.426421
H  1.801019 1.712802 -2.090079
H  0.547596 2.641543 -1.190153
H  3.82063 1.886204 0.485552
H  0.63332 -3.064491 -0.540194
H  -7.329146 0.331762 -1.090375
H  -7.453969 1.678054 0.098645
H  -7.778298 0.000214 0.620413
H  2.186246 4.303349 -1.923087
H  2.409561 4.060947 -0.160092
H  3.572808 3.347625 -1.338105
H  6.353914 -1.758783 1.147631
