program: Gaussian 09
title: 000134844
version: EM64L-G09RevD.01
frameworkgroup: C1[X(C17H22N2O3)]
method: RPBEPBE
basis: SDD
operation: Freq
keyword: #p
keyword: freq=noraman
keyword: PBEPBE/SDD
title: #p freq=noraman PBEPBE/SDD
converged: YES YES NO NO
title: Mulliken charges:
elementType: O O O N N C C C C C C C C C C C C C C C C C H H H H H H H H H H H H H H H H H H H H H H
charge: -0.297900 -0.451586 -0.436081 -0.064102 -0.544527 0.131880 0.278776 -0.174460 -0.240918 -0.506478 0.043700 -0.567515 -0.171063 -0.595495 -0.396662 -0.420028 0.440248 0.103263 -0.634029 -0.451861 0.099159 -0.340540 0.212109 0.227072 0.218410 0.215649 0.205932 0.233262 0.221174 0.211496 0.233199 0.225271 0.209532 0.217452 0.209699 0.334055 0.191479 0.228211 0.223463 0.230583 0.261131 0.279467 0.239691 0.367882
chargesum: 0.00000
title: Mulliken charges with hydrogens summed into heavy atoms:
elementType: O O O N N C C C C C C C C C C C C C C C C C
charge: -0.297900 -0.117531 -0.068199 -0.064102 -0.003929 0.131880 0.278776 0.037649 -0.013846 -0.072419 0.043700 -0.128321 0.050111 -0.150801 0.038141 0.007123 0.440248 0.103263 0.009124 -0.221277 0.099159 -0.100849
polarizability: 2.29057719e+02 9.25528560e-01 2.09966457e+02 -9.52028433e-01 1.24861834e+01 1.47832724e+02
1716.lowfreq: -3.8297 -0.0007 -0.0005 0.0002 12.3550 20.5693 55.3139 84.9421 110.9451
frequency: 55.2969 84.9382 110.9311 119.5539 145.7434 174.4375 203.6916 212.6498 225.0358 234.6526 253.3886 264.5388 269.0215 277.7842 300.6641 306.9425 329.5118 334.8625 348.4705 358.8828 369.4801 373.6495 406.5471 441.8875 455.7851 466.2452 489.0626 521.1701 532.8548 544.9161 554.4552 569.6631 589.1827 610.0131 631.6829 653.6782 693.5456 710.2036 727.8159 744.6400 754.5085 773.3807 795.8519 812.8430 857.6496 873.2920 892.6351 915.1384 920.0880 927.7851 937.1146 950.0973 994.4169 1001.0807 1012.5564 1020.3318 1042.8883 1064.2515 1080.5530 1100.6029 1103.1766 1106.9414 1120.1787 1131.1960 1136.1971 1145.5098 1150.8727 1157.0986 1158.9041 1172.4766 1197.1260 1210.7770 1214.7165 1221.3867 1224.8505 1237.2473 1264.1289 1285.6383 1301.4619 1311.5826 1315.0581 1321.3855 1327.0398 1333.7152 1340.6483 1343.7804 1349.1744 1363.4926 1374.9079 1383.8847 1407.7447 1432.2364 1435.4222 1450.6756 1454.2146 1456.8099 1463.8104 1481.1649 1483.0420 1497.7924 1500.4305 1614.0138 1634.8897 1648.5012 2863.5291 2877.4495 2954.0685 2968.1656 2971.7158 2975.8472 2986.1009 2987.2036 3011.2618 3014.5294 3021.7857 3032.0772 3045.9731 3050.9721 3072.7125 3073.5177 3125.8551 3162.4264 3420.1225 3540.6344 3541.7144 3570.0100
redmass: 4.1974 4.8143 3.6168 3.7276 2.6934 4.3590 4.0959 2.2851 1.2984 1.6937 2.4211 1.4083 2.3348 2.7916 2.9155 2.5690 3.9029 3.1586 2.8031 3.3674 1.1211 3.0578 4.5792 3.6291 4.0734 4.0770 3.7634 3.9796 3.3662 3.5126 3.3164 4.5325 3.5774 4.6797 5.0027 4.8223 3.8765 4.0290 1.6203 3.5349 3.2468 2.7856 1.6080 2.6866 2.4542 4.1051 3.4930 2.2442 2.1156 1.8403 3.4592 2.5378 2.5746 2.3900 2.1949 1.7180 2.6412 2.0926 2.0881 1.9974 1.9151 2.4558 1.7680 2.2673 2.1218 2.7659 2.3815 2.3920 1.5275 1.3457 1.6611 1.5906 1.6253 1.6180 1.6643 1.5568 1.7288 1.6230 1.4026 1.4395 1.6735 1.6915 1.3373 1.4751 1.4200 1.4478 1.2272 1.5468 1.5023 1.5173 5.5513 1.1922 2.7771 1.0893 1.3032 1.0839 1.0568 1.0869 1.0675 1.5843 1.7202 8.3698 8.5823 1.0938 1.0587 1.0676 1.0837 1.0651 1.0674 1.0816 1.0789 1.0722 1.0611 1.0734 1.0872 1.0943 1.1005 1.0958 1.1019 1.1008 1.0887 1.0944 1.0451 1.0951 1.0660 1.0659
irintensity: 0.0594 0.4554 0.9073 0.9952 1.0204 6.7746 1.3018 4.0642 29.0609 20.8610 6.8150 45.6876 58.8151 1.4503 4.0146 0.8900 3.1276 1.6271 15.3756 2.0149 122.0711 6.7201 6.9626 3.6943 8.4671 5.1046 14.4917 3.4301 27.3499 4.4773 10.1916 5.2547 9.2159 2.0066 3.7645 0.2982 1.1862 7.9839 267.2949 20.5243 29.7756 9.9505 18.3477 21.1304 16.8395 60.1135 44.0212 38.9193 16.4718 3.8591 14.7267 2.2776 13.6184 6.2130 27.1456 29.5468 5.8840 10.6175 4.6981 12.6207 2.0415 8.8584 16.4592 81.9213 14.4524 4.4213 16.7496 77.7597 113.6694 14.7613 42.6337 2.1340 4.4839 3.8915 2.2513 1.6925 10.0020 14.3262 6.5996 9.6356 18.5327 4.4727 8.0537 4.0137 2.4503 11.5769 2.0693 7.0759 3.1197 7.4390 14.7481 12.5816 33.2307 1.8243 49.9723 9.3368 17.9120 11.1791 8.8671 47.8165 15.0708 23.0902 22.0697 34.5720 68.0139 116.2097 10.1264 40.8565 26.6596 31.4040 74.8708 25.6704 36.7658 53.8830 61.4376 14.2153 38.1772 7.9309 32.2626 35.6915 13.3594 13.6007 1.5534 0.8242 6.9930 48.3295
temp: 298.150 k
press: 1.00000 atm
elementType: 8 8 8 7 7 6 6 6 6 6 6 6 6 6 6 6 6 6 6 6 6 6 1 1 1 1 1 1 1 1 1 1 1 1 1 1 1 1 1 1 1 1 1 1
symmnumber: 1
zpe: 962739.7 jmol-1
zpe.correction: 0.366688 hartree
zpe.thermalcorrener: 0.385572 hartree
zpe.thermalcorrenthalpy: 0.386517 hartree
zpe.thermalcorrgfe: 0.322754 hartree
zpe.sumelectzpe: -994.487474 hartree
zpe.sumelectthermal: -994.468590 hartree
zpe.sumelectthermalent: -994.467646 hartree
zpe.sumelectthermalfe: -994.531409 hartree
dipole: 4.0394 0.9236 0.4315
dipole: 4.1660
quadrupole: -129.3187 -135.7317 -122.5325
quadrupole: -8.6654 -4.2092 5.9090
quadrupole: -0.1244 -6.5374 6.6618 -8.6654 -4.2092 5.9090
hfenergy: -994.8541625 hartree
pointgroup: C01 [X(C17H22N2O3)]
dipole: 1.626556 0.0781422 0.1861355 debye
polarizability: 228.7601046|-2.55748|210.0332423|2.0105752|12.9242254|148.0635532 unknown
InChI: InChI=1S/C17H22N2O3/c1-19-7-6-16-13-9-2-3-11(20)14(13)22-15(16)10(18)4-5-17(16,21)12(19)8-9/h2-3,10,12,15,20-21H,4-8,18H2,1H3
charge 0 multiplicity 1
44 atoms
O  -1.983127 1.200898 0.530346
O  0.149774 0.265403 -1.86418
O  -4.358576 -0.572101 0.08627
N  3.030054 -0.779293 0.324039
N  -1.268041 3.925733 0.022023
C  0.354265 0.404325 0.584732
C  1.140901 0.427897 -0.761055
C  -0.569686 1.62756 0.891886
C  2.013941 -0.870045 -0.759924
C  1.341893 0.269207 1.788916
C  -0.627831 -0.723997 0.403477
C  1.822817 1.793248 -0.959098
C  -0.142229 2.997484 0.262119
C  1.108948 -2.185297 -0.683343
C  0.71974 2.887936 -1.024163
C  2.386307 -0.848719 1.65389
C  -0.314153 -1.970841 -0.160087
C  -1.928836 -0.212792 0.399487
C  4.163746 -1.711301 0.179647
C  -1.414337 -2.81846 -0.460514
C  -3.029216 -1.035885 0.095828
C  -2.749325 -2.371043 -0.286071
H  -0.617254 1.759127 1.99273
H  2.574119 -0.903814 -1.716123
H  0.744354 0.094998 2.70338
H  1.871179 1.233669 1.917968
H  2.409262 1.797552 -1.901653
H  2.542964 1.988452 -0.144521
H  0.500216 3.467497 1.035758
H  1.664424 -2.940026 -0.088841
H  1.021095 -2.608531 -1.701224
H  1.171698 3.880711 -1.198651
H  0.052659 2.677901 -1.879983
H  3.165503 -0.721399 2.428813
H  1.904596 -1.840886 1.838214
H  0.627909 0.440019 -2.715657
H  3.890157 -2.789114 0.301862
H  4.929809 -1.474575 0.940616
H  4.623543 -1.587059 -0.817201
H  -1.24281 -3.812989 -0.889114
H  -1.715098 4.248615 0.889361
H  -1.969893 3.501061 -0.598515
H  -3.594361 -3.02396 -0.527565
H  -4.374799 0.384234 0.343622
