program: Gaussian 09
title: 000134825
version: EM64L-G09RevD.01
frameworkgroup: C1[X(C6H12N3O5P)]
method: RPBEPBE
basis: SDD
operation: Freq
keyword: #p
keyword: freq=noraman
keyword: PBEPBE/SDD
title: #p freq=noraman PBEPBE/SDD
converged: YES YES NO NO
title: Mulliken charges:
elementType: P O O O O O N N N C C C C C C H H H H H H H H H H H H
charge: 1.357739 -0.713132 -0.689186 -0.639070 -0.404710 -0.234166 -0.180472 -0.593237 -0.634627 -0.375961 -0.341826 0.531470 -0.386850 -0.465269 0.202765 0.240298 0.250096 0.269971 0.264942 0.246902 0.243331 0.261130 0.273499 0.323541 0.426714 0.379537 0.386569
chargesum: 0.00000
title: Mulliken charges with hydrogens summed into heavy atoms:
elementType: P O O O O O N N N C C C C C C
charge: 1.357739 -0.713132 -0.309649 -0.639070 -0.018140 -0.234166 -0.180472 -0.593237 0.115629 0.114433 0.193087 0.531470 0.103383 0.069361 0.202765
polarizability: 1.62050647e+02 5.28226794e+00 1.14542432e+02 2.09430580e+00 5.36090636e+00 9.33457700e+01
1716.lowfreq: -4.1045 -0.0017 -0.0015 -0.0007 2.9399 7.8920 15.5020 18.3476 30.5471
frequency: 15.2054 18.1643 30.4680 55.6278 62.5583 68.7675 85.2879 157.9653 162.5685 190.6287 196.3250 244.7937 266.1326 309.6499 325.2479 334.7357 383.5060 385.1591 426.3196 444.1133 462.1013 517.4866 523.4991 577.9269 646.6149 653.4911 662.0475 679.3281 723.0118 774.5900 829.7221 866.0734 879.8142 896.2734 976.1387 983.4751 995.8928 1005.1017 1026.6271 1051.3313 1076.4302 1089.9109 1108.2392 1122.7589 1171.4953 1193.1502 1213.4646 1234.3286 1243.9911 1264.4654 1298.8120 1308.5060 1335.6946 1365.6825 1378.4650 1444.0492 1473.8746 1484.1525 1501.0398 1507.1154 1595.3906 1658.9400 1665.0577 2721.9004 2989.0778 3001.3415 3009.5889 3025.0180 3048.1623 3056.9750 3083.8009 3092.8647 3509.6078 3596.2943 3621.6090
redmass: 9.7367 6.4419 7.7405 4.1260 1.9092 2.5080 8.4937 3.5156 8.0289 4.6159 2.1245 4.2846 7.4535 2.7032 5.3086 2.9394 7.3196 5.6740 3.4767 3.2579 1.5913 2.5710 2.9086 3.7341 13.0802 1.5086 3.7418 7.3716 5.1381 1.3912 1.8498 5.1496 3.0752 3.3035 2.6004 1.1542 1.4946 2.2705 3.6235 2.2950 2.3813 4.2953 1.6538 2.3088 1.9122 1.1717 1.2230 1.5319 1.5286 2.1866 1.4174 1.3636 1.7339 1.5910 1.5986 1.0833 1.1098 1.2725 1.1666 1.2188 2.6066 7.1090 4.2653 1.0827 1.0604 1.0640 1.0616 1.0632 1.1025 1.1005 1.0997 1.1071 1.0640 1.0659 1.0816
irintensity: 2.5397 1.3326 1.2545 1.6715 0.7251 0.2873 2.5510 30.9489 6.9286 0.5738 31.9317 15.6557 1.1817 20.0002 15.3056 48.3117 30.1219 40.6781 22.6631 90.0126 98.5641 64.8826 74.0252 134.5749 120.7695 129.3222 35.1998 14.0977 6.9209 12.9831 18.9045 85.4569 21.0086 42.9328 12.3280 152.9331 26.7840 29.4013 87.2988 27.7284 269.6796 137.5958 6.5967 57.1915 42.4010 6.0005 21.3799 5.6166 1.0398 8.9114 14.0395 100.0435 16.4432 18.4279 92.9653 19.2679 17.2772 20.7011 2.7425 14.1482 572.7136 120.6717 559.3191 840.4118 41.2010 8.9160 15.4925 21.4696 19.4364 3.7560 11.8919 13.1659 29.6649 36.3052 55.7339
temp: 298.150 k
press: 1.00000 atm
elementType: 15 8 8 8 8 8 7 7 7 6 6 6 6 6 6 1 1 1 1 1 1 1 1 1 1 1 1
symmnumber: 1
zpe: 528659.9 jmol-1
zpe.correction: 0.201356 hartree
zpe.thermalcorrener: 0.218093 hartree
zpe.thermalcorrenthalpy: 0.219037 hartree
zpe.thermalcorrgfe: 0.153092 hartree
zpe.sumelectzpe: -1116.282707 hartree
zpe.sumelectthermal: -1116.265970 hartree
zpe.sumelectthermalent: -1116.265026 hartree
zpe.sumelectthermalfe: -1116.330971 hartree
dipole: -9.5433 4.1089 1.2837
dipole: 10.4693
quadrupole: -111.3827 -93.1280 -99.0723
quadrupole: 4.9962 5.5958 -2.1948
quadrupole: -10.1884 8.0663 2.1220 4.9962 5.5958 -2.1948
hfenergy: -1116.4840625 hartree
pointgroup: C01 [X(C6H12N3O5P1)]
dipole: 3.7379252 1.2412883 -1.2052819 debye
polarizability: 162.1584138|-3.8684249|106.2770034|3.4821812|-11.5885597|101.5034318 unknown
InChI: InChI=1S/C6H12N3O5P/c7-6-8(2-1-5(10)11)3-4-9(6)15(12,13)14/h10,12H,1-4,7H2
charge 0 multiplicity 1
27 atoms
P  -3.423634 -0.483831 0.228857
O  -3.034595 -1.81305 1.06597
O  -3.517201 -0.812795 -1.49956
O  -4.53259 0.585321 0.641161
O  4.979324 -0.504865 -1.066444
O  4.388534 -0.699839 1.172791
N  0.432616 0.724722 0.29907
N  -1.786419 0.35033 0.102212
N  -0.504136 -1.333077 1.185535
C  -0.080278 1.9676 -0.340299
C  -1.583219 1.637185 -0.610699
C  -0.602344 -0.143475 0.561442
C  1.833263 0.530882 0.669759
C  2.690422 -0.032032 -0.492309
C  4.071007 -0.4361 -0.008483
H  0.467548 2.186997 -1.27374
H  0.041542 2.824184 0.349868
H  -2.265167 2.402875 -0.207405
H  -1.796186 1.498675 -1.684567
H  2.24743 1.499237 1.007165
H  1.910605 -0.145625 1.540266
H  2.792045 0.689038 -1.321124
H  2.204024 -0.931793 -0.917379
H  0.373795 -1.677312 1.566883
H  -1.449696 -1.830993 1.294163
H  -4.454162 -0.862849 -1.817976
H  5.866974 -0.808112 -0.730457
