program: Gaussian 09
title: 000134798
version: EM64L-G09RevD.01
frameworkgroup: C1[X(C8H11N3)]
method: RPBEPBE
basis: SDD
operation: Freq
keyword: #pfreq=noraman
keyword: PBEPBE/SDD
title: #p freq=noraman PBEPBE/SDD
converged: YES YES NO NO
title: Mulliken charges:
elementType: N N N C C C C C C C C H H H H H H H H H H H
charge: -0.415968 0.000104 -0.134105 0.462886 -0.408567 -0.372808 -0.190432 -0.193254 -0.263866 -0.386013 -0.658048 0.221012 0.267190 0.224649 0.224887 0.228585 0.297623 0.217521 0.215417 0.211165 0.223221 0.228802
chargesum: 0.00000
title: Mulliken charges with hydrogens summed into heavy atoms:
elementType: N N N C C C C C C C C
charge: -0.118345 0.000104 -0.134105 0.462886 -0.187555 -0.105619 0.034217 0.031634 -0.035282 0.046925 0.005139
polarizability: 2.09000192e+02 -1.96644992e+00 1.04099325e+02 -7.25940684e+00 -1.82326535e+00 5.52188230e+01
1716.lowfreq: -3.9277 -0.0003 -0.0002 -0.0001 3.7223 11.9959 38.3775 53.8950 103.4757
frequency: 38.2054 53.8909 103.4742 121.2038 222.9352 230.8705 250.6674 322.5924 334.4264 406.1394 450.5745 508.2552 555.1945 614.4607 622.9052 677.6403 699.0306 761.8715 805.0131 824.1414 834.9298 902.6857 924.5885 967.6697 982.5768 988.6569 1021.1482 1037.3587 1075.8935 1087.9566 1115.0836 1168.6374 1170.8856 1182.0397 1244.8549 1262.4855 1319.6659 1323.3641 1375.7291 1384.2713 1404.4374 1439.7538 1460.1023 1466.0275 1477.9614 1485.1435 1505.3586 1596.2146 1617.9793 2968.4910 2988.6813 3033.9671 3088.8317 3095.6390 3118.2389 3131.9561 3144.2425 3164.9348 3182.0491 3401.8073
redmass: 2.7260 3.6376 3.0731 4.4920 1.2428 5.5251 3.1704 3.1811 4.3795 2.9055 3.8918 2.9434 4.0099 6.3562 5.4199 1.3579 1.8138 1.7073 1.2110 3.3148 1.2578 1.4508 2.2710 1.3596 6.0762 1.3081 2.1297 3.8449 1.8265 1.7712 2.2608 1.9933 1.1455 1.1979 1.3277 1.7004 1.4317 1.3586 2.7690 1.5169 5.3982 2.2805 1.1128 1.0688 1.9365 1.0675 2.5211 5.9104 6.2180 1.0574 1.0352 1.1036 1.0996 1.1015 1.0874 1.0870 1.0934 1.0985 1.0962 1.0747
irintensity: 0.2959 0.3520 0.1150 0.1240 3.1568 2.7212 4.3116 12.8071 9.5042 0.0217 4.0246 17.9616 5.8414 1.8444 20.2985 34.2971 94.6840 84.9132 3.6736 2.4088 0.4476 10.4221 1.9842 0.0029 1.5968 1.4352 1.8653 11.0063 27.2163 15.2932 41.4420 134.2980 16.4139 6.0051 89.4044 85.6612 4.7478 13.2163 23.0039 7.3028 86.0573 59.5773 12.8806 10.3239 0.2806 9.1652 239.8001 6.4130 122.7587 56.7461 42.4710 14.7886 47.0908 37.8968 12.4857 0.7806 31.0194 29.8443 3.6219 3.6405
temp: 298.150 k
press: 1.00000 atm
elementType: 7 7 7 6 6 6 6 6 6 6 6 1 1 1 1 1 1 1 1 1 1 1
symmnumber: 1
zpe: 471004.4 jmol-1
zpe.correction: 0.179396 hartree
zpe.thermalcorrener: 0.189980 hartree
zpe.thermalcorrenthalpy: 0.190924 hartree
zpe.thermalcorrgfe: 0.142184 hartree
zpe.sumelectzpe: -474.835610 hartree
zpe.sumelectthermal: -474.825026 hartree
zpe.sumelectthermalent: -474.824082 hartree
zpe.sumelectthermalfe: -474.872823 hartree
dipole: 0.0814 -0.2590 0.1243
dipole: 0.2985
quadrupole: -56.4493 -59.3246 -69.6163
quadrupole: 3.1879 -0.9538 -0.6092
quadrupole: 5.3474 2.4722 -7.8196 3.1879 -0.9538 -0.6092
hfenergy: -475.0150063 hartree
pointgroup: C01 [X(C8H11N3)]
dipole: 0.033756 0.1108648 -0.0191134 debye
dipolederiv: -1.8267112 -0.0839303 -0.1544305 0.8733479 -0.0223818 0.1453252 -0.0107362 0.0495185 -0.2905374 1.6859212 -0.1375389 0.1484987 -0.7820252 -0.0972666 -0.1012391 0.064499 -0.0355535 0.0071184 -1.1836915 0.1191704 -0.0510013 -0.5752562 -0.12837 -0.0107657 -0.2161464 0.0375943 -0.306701 1.5226158 0.2272332 0.2041204 0.4762862 0.0662488 0.0384581 0.2902288 0.0197445 0.1451956 -0.4692271 -0.0844955 -0.0404073 0.1499625 0.0515507 0.0811238 0.002 0.0504345 -0.2046313 -0.2151571 -0.012379 -0.0025535 -0.3662182 -0.0846726 -0.0180617 -0.0858963 0.0221067 -0.1909262 0.206565 0.0234339 0.0468231 -0.0569383 0.1229484 0.0501342 0.031406 0.0617058 -0.1162065 0.091828 -0.048256 0.0188088 0.0858116 0.1579891 0.0748723 0.0490657 0.0598298 -0.1140557 -0.1056307 0.0538401 0.0299874 -0.0204101 -0.1904256 0.0033872 0.0081245 0.0103736 -0.1995721 0.3653723 -0.0513999 0.0346053 -0.2404047 0.2153221 -0.0251554 0.0300273 0.0187206 0.2200592 -0.021325 -0.0211226 0.0505254 0.1696714 0.0464079 0.0466631 0.0067717 0.0249535 -0.0007201 0.0689771 -0.0762188 -0.0317424 -0.0517516 -0.0852568 -0.0650879 -0.0249404 -0.0683551 0.1516642 0.042887 0.0818533 0.0004099 0.0852767 0.0429518 -0.0196218 0.0025355 -0.0184924 0.1653866 -0.0438705 0.1058909 -0.0009047 0.1269273 -0.0103619 -0.0219349 0.0027054 -0.0240769 0.1507924 0.0669695 -0.0356359 -0.0187397 -0.0653077 -0.1017646 -0.0651471 -0.0260934 -0.0624547 0.134809 -0.1170301 -0.051344 -0.049059 -0.0565535 0.0761678 -0.0293551 -0.0509534 -0.0289303 0.1599664 0.0704513 0.0047193 -0.0303416 0.0582439 0.0583706 -0.051344 -0.0209195 -0.0568819 0.3021201 -0.084732 0.0228276 -0.0875743 0.1082573 0.0791215 -0.0196539 -0.0958279 0.0169458 -0.1237904 -0.0262275 -0.0849505 0.0117279 0.0868456 -0.1758817 0.0008618 0.0417471 -0.0436514 0.0722464 -0.1937241 0.1197661 0.0152409 0.1412224 0.0143441 0.0071448 0.0627602 0.0136298 0.0887032 0.0540079 -0.0190152 -0.1044073 -0.0359532 0.0894172 -0.0150904 -0.0360671 -0.0069271 -0.1257516 0.1117314 -0.0524483 0.0104136 -0.111034 -0.1244585 -0.0055136 -0.0242906 -0.0402339 0.0748307 unknown
polarizability: 208.0869474|-1.335436|101.6760037|13.9351947|10.6719606|58.5553888 unknown
InChI: InChI=1S/C8H11N3/c1-2-9-11-10-8-6-4-3-5-7-8/h3-7,10H,2H2,1H3
charge 0 multiplicity 1
22 atoms
N  0.482551 0.753196 0.424084
N  1.539879 -0.122049 0.366531
N  2.6712 0.46437 0.647752
C  -0.838023 0.334841 0.156579
C  -1.881636 1.295581 0.238405
C  -1.139532 -1.010231 -0.189162
C  -3.213317 0.912674 -0.024254
C  -2.476143 -1.374973 -0.448147
C  -3.521665 -0.423622 -0.369526
C  3.818914 -0.479794 0.56932
C  4.783934 -0.035987 -0.549998
H  -1.650537 2.334462 0.505856
H  -0.330283 -1.742048 -0.24893
H  -4.010391 1.661656 0.041719
H  -2.703604 -2.413556 -0.714291
H  -4.556357 -0.718233 -0.573181
H  0.688072 1.732187 0.674076
H  4.341661 -0.429562 1.544102
H  3.474609 -1.52093 0.405629
H  5.695108 -0.661439 -0.54069
H  4.30602 -0.128633 -1.541026
H  5.08274 1.017591 -0.408448
