program: Gaussian 09
title: 000134792
version: EM64L-G09RevD.01
frameworkgroup: C1[X(C10H10N4O2)]
method: RPBEPBE
basis: SDD
operation: Freq
keyword: #p
keyword: freq=noraman
keyword: PBEPBE/SDD
title: #p freq=noraman PBEPBE/SDD
converged: NO YES NO NO
title: Mulliken charges:
elementType: O O N N N N C C C C C C C C C C H H H H H H H H H H
charge: -0.225862 -0.281494 -0.220664 -0.044218 0.064935 0.059976 0.410692 0.121772 0.291194 -0.586268 -0.410419 -0.397146 -0.343947 -0.245166 -0.202443 -0.590894 0.241548 0.276599 0.311543 0.287664 0.268930 0.234149 0.233514 0.262832 0.233035 0.250136
chargesum: 0.00000
title: Mulliken charges with hydrogens summed into heavy atoms:
elementType: O O N N N N C C C C C C C C C C
charge: -0.225862 -0.281494 -0.220664 -0.044218 0.064935 0.059976 0.410692 0.121772 0.291194 -0.068120 -0.098876 -0.109481 -0.075017 -0.011017 0.031072 0.155109
polarizability: 1.96638548e+02 2.90378936e+01 1.96014691e+02 -9.27876250e+00 3.69815581e+00 7.84365981e+01
1716.lowfreq: -4.6506 0.0004 0.0005 0.0008 4.4812 9.1674 32.5516 62.4142 77.7182
frequency: 32.5253 62.4096 77.7167 107.9164 146.8179 152.2907 165.8278 184.4917 217.8138 260.9279 272.9228 332.0215 361.2852 368.7398 381.4846 432.3455 454.5561 506.5475 537.1996 575.9410 591.6773 636.0431 658.8129 713.8585 743.0677 769.0586 773.5866 798.5610 830.9686 838.6892 889.4861 928.4987 961.6466 965.8139 973.4232 998.5170 1015.0166 1075.2801 1102.1891 1114.6914 1117.7485 1152.6531 1178.9106 1205.7527 1219.0747 1264.4092 1305.6875 1320.8012 1323.4023 1339.0077 1355.7372 1366.0779 1411.9485 1420.2312 1448.5628 1454.9424 1462.0493 1467.7349 1482.7577 1557.4946 1598.1905 1621.9560 2982.8099 2994.6913 3061.6830 3066.5990 3121.1822 3135.0090 3146.2384 3163.5030 3182.0778 3244.4931
redmass: 5.3279 4.6233 7.2728 5.9164 8.6739 1.4697 2.2851 5.1058 5.0250 4.5984 5.7800 4.3908 4.2138 4.9103 4.0052 3.1629 5.4798 4.1185 6.6852 4.1185 4.7679 4.8407 5.3460 5.5225 4.9591 2.0592 1.9986 2.5722 4.2575 2.1216 1.3739 2.9187 1.9360 1.3842 6.8906 1.3207 2.2352 2.7476 3.1254 1.4330 1.5102 1.6948 1.1334 2.5443 3.2124 2.1078 1.7824 2.5254 5.3664 1.5828 3.2592 4.2218 4.2214 1.1610 1.2569 2.4375 1.0516 2.8821 1.0568 6.1678 7.2019 7.6964 1.0347 1.0583 1.1023 1.1014 1.0992 1.0878 1.0916 1.0963 1.0978 1.0980
irintensity: 5.0715 4.8781 4.6161 0.4332 2.7102 0.8528 2.5756 1.0561 2.5367 5.2993 2.2888 5.3433 0.2985 6.4401 2.6547 8.9427 1.7574 2.5257 18.1627 2.0771 4.6670 2.4420 3.9194 23.1790 8.3217 53.3690 54.8235 21.7660 42.8936 8.5863 0.5270 75.5862 31.6990 5.2893 102.1032 0.2559 9.7045 97.9344 84.5665 1.5279 0.9774 32.5138 0.5026 78.8523 4.0965 70.1228 0.2831 49.9116 134.0152 68.2647 78.8273 110.0974 9.4284 21.4441 23.6275 15.0285 22.5740 2.0673 11.8261 11.8298 0.2738 2.4133 29.3715 21.3619 16.7091 22.2196 4.3313 3.4598 2.0200 19.7102 7.5625 15.1210
temp: 298.150 k
press: 1.00000 atm
elementType: 8 8 7 7 7 7 6 6 6 6 6 6 6 6 6 6 1 1 1 1 1 1 1 1 1 1
symmnumber: 1
zpe: 503532.6 jmol-1
zpe.correction: 0.191785 hartree
zpe.thermalcorrener: 0.205902 hartree
zpe.thermalcorrenthalpy: 0.206847 hartree
zpe.thermalcorrgfe: 0.150108 hartree
zpe.sumelectzpe: -755.237039 hartree
zpe.sumelectthermal: -755.222922 hartree
zpe.sumelectthermalent: -755.221978 hartree
zpe.sumelectthermalfe: -755.278716 hartree
dipole: 0.7695 -1.0277 0.6426
dipole: 1.4357
quadrupole: -111.2544 -85.9495 -91.8076
quadrupole: -21.6855 1.2350 1.3869
quadrupole: -14.9173 10.3877 4.5296 -21.6855 1.2350 1.3869
hfenergy: -755.4288244 hartree
pointgroup: C01 [X(C10H10N4O2)]
dipole: 0.3733182 0.3699405 -0.206955 debye
dipolederiv: -0.1412173 -0.1466262 -0.0366576 1.0640308 -1.4861443 -0.0380076 0.2119522 -0.300672 -0.1844113 -0.259324 -0.1115282 0.0720988 0.3673662 -0.8717074 0.1425087 -0.3330553 0.6143902 -0.4104865 -0.7727693 0.9517602 -0.0182628 0.381707 -0.680884 -0.0602552 -0.1704702 0.1296804 0.0339912 -0.3097551 0.3088792 -0.1962202 -0.0496128 -0.6215489 0.1774933 -0.2005766 -0.0716884 -0.1265155 0.6155524 -0.754486 0.0526472 -1.4018697 1.637685 0.0352563 -0.080024 0.1239259 -0.0435843 -0.0591696 -0.3391068 0.0561126 -0.5101177 1.1455908 -0.2625968 0.4812251 -0.4365317 0.0249006 0.4574709 -0.0036287 0.0543189 0.151073 0.074623 0.0484085 0.171743 -0.0298845 -0.1013169 -0.2331855 0.1839114 -0.0190149 -0.1270439 0.1512553 0.0002421 -0.1128076 0.0950807 -0.01432 -0.063081 -0.1290403 -0.0499342 -0.136823 0.5457551 0.0519867 -0.0584353 0.0709777 0.0333596 0.1477453 0.1081755 0.0434651 0.1580835 0.0058639 0.0782592 -0.0069437 0.1265499 0.181693 0.0239987 -0.0707551 0.0674986 0.0328333 -0.3445888 -0.0354314 0.0742192 -0.051727 -0.120363 0.0793409 -0.0942331 0.0323623 0.109529 -0.154016 0.0374857 0.078425 -0.0302039 -0.1125945 0.0719885 -0.0618636 0.0493144 0.0435293 -0.188023 0.0022904 0.0696636 -0.028856 -0.1217973 -0.1824592 0.0270135 0.0082724 -0.0911069 0.1674594 0.0302596 -0.0184503 0.0667922 -0.1451056 0.1033109 -0.0401001 0.0684846 -0.0273804 0.0967435 0.0468705 0.0671866 0.0399734 -0.1327341 0.1306994 0.1164106 0.0571796 0.2144349 0.2706917 -0.0984787 0.0053666 -0.1125163 0.2161202 -0.0032647 -0.0065548 0.0035119 -0.0808095 -0.056406 -0.1192986 0.0203333 -0.0590543 0.0840958 0.0781288 0.0014026 -0.0296337 -0.0826889 0.0947155 0.1228143 0.0501284 0.0085224 0.0686382 0.0924837 0.0198556 -0.0294679 -0.0400893 0.0959647 -0.0280657 -0.0441986 -0.0169917 0.1895533 0.0484386 0.0731692 -0.0370221 0.025078 0.1190021 -0.0130796 -0.028964 0.0037837 0.1370676 0.0035975 0.0238538 -0.0427444 0.0674788 0.0785673 -0.0010333 -0.0337846 -0.0131031 0.1618109 0.0815069 0.0533578 -0.01287 0.0354371 -0.1023995 -0.0366595 -0.0152856 -0.0358026 0.1484051 0.0051187 -0.0963728 -0.0594284 -0.0899604 -0.0023238 -0.0551084 -0.0620576 -0.0580673 0.1328221 0.0345476 0.0036909 0.1022716 0.0817498 0.0963444 -0.0622046 0.0769414 0.0023109 0.0382159 0.0847593 -0.0612663 -0.0217554 -0.0973699 -0.1014663 -0.0089755 -0.0692726 -0.0805454 0.010537 -0.0344624 0.0440818 -0.1145264 0.0025416 0.0292462 0.0453197 -0.0728583 0.0436569 0.0520187 unknown
polarizability: 186.4707802|-28.7899113|204.1058926|11.1778559|12.3728676|80.5131635 unknown
InChI: InChI=1S/C10H10N4O2/c1-13(11-15)6-8-7-14(12-16)10-5-3-2-4-9(8)10/h2-5,7H,6H2,1H3
charge 0 multiplicity 1
26 atoms
O  -2.786122 3.19933 0.343764
O  3.367166 -1.581243 0.716223
N  -1.70607 1.229316 0.258058
N  2.822042 0.496652 0.027676
N  -2.905369 1.958952 0.063981
N  3.568721 -0.65143 -0.155435
C  0.43405 0.626058 0.744289
C  -0.292858 -0.572612 0.300416
C  -1.631711 -0.170843 0.000036
C  1.87795 0.675222 1.168588
C  -0.447985 1.697156 0.707362
C  0.076122 -1.929815 0.147026
C  -2.619633 -1.060569 -0.449157
C  -0.90689 -2.839249 -0.305357
C  -2.230806 -2.412851 -0.599952
C  3.005252 1.551481 -0.976408
H  2.108764 1.641451 1.651667
H  2.110798 -0.147338 1.872327
H  -0.315482 2.744873 0.964727
H  1.093582 -2.265275 0.376255
H  -3.636333 -0.725134 -0.668651
H  -0.645713 -3.895338 -0.431325
H  -2.966761 -3.145328 -0.948348
H  3.723034 1.181077 -1.724476
H  3.402639 2.471819 -0.509546
H  2.045714 1.78784 -1.469938
