program: Gaussian 09
title: 000134939
version: EM64L-G09RevD.01
frameworkgroup: C1[X(C21H28O6)]
method: RPBEPBE
basis: SDD
operation: Freq
keyword: #pfreq=noraman
keyword: PBEPBE/SDD
title: #p freq=noraman PBEPBE/SDD
converged: YES YES NO NO
title: Mulliken charges:
elementType: O O O O O O C C C C C C C C C C C C C C C C C C C C C H H H H H H H H H H H H H H H H H H H H H H H H H H H H
charge: -0.237143 -0.372559 -0.201661 -0.212013 -0.434925 -0.282367 -0.536263 -0.478881 0.463313 -0.647630 0.319435 -0.309893 0.226594 -0.283059 0.372903 -0.508539 -0.060118 -0.847263 0.000946 0.153735 0.078314 -0.494771 -0.799546 -0.821792 0.219359 -0.511394 -0.506594 0.204321 0.216382 0.204260 0.211004 0.255187 0.217930 0.226001 0.227872 0.238385 0.192527 0.237430 0.243669 0.218731 0.248230 0.247712 0.265370 0.222732 0.248442 0.226069 0.223317 0.228230 0.269491 0.225805 0.251692 0.232043 0.272922 0.231312 0.424746
chargesum: 0.00000
title: Mulliken charges with hydrogens summed into heavy atoms:
elementType: O O O O O O C C C C C C C C C C C C C C C C C C C C C
charge: -0.237143 -0.372559 -0.201661 -0.212013 -0.010178 -0.282367 -0.115559 -0.063617 0.463313 -0.174513 0.319435 -0.083892 0.226594 -0.055187 0.372903 -0.077628 -0.060118 -0.147432 0.000946 0.153735 0.078314 0.001171 -0.063002 -0.144175 0.219359 0.235593 0.229682
polarizability: 2.75213255e+02 2.12389209e+01 2.43459987e+02 -2.93812391e+01 -1.03271242e+01 2.54781207e+02
1716.lowfreq: -3.1496 -0.0006 -0.0003 0.0003 8.2552 11.0670 26.0817 31.2333 41.4827
frequency: 25.9908 31.0638 41.3740 42.4710 54.2728 59.6088 61.1699 65.5356 73.2863 80.3279 94.2303 102.0883 104.8056 115.5190 118.2893 130.2331 137.7979 147.4364 153.6948 165.3060 178.1190 205.9450 211.2242 224.6065 235.2613 241.0812 269.5524 287.5153 317.6466 321.2055 328.8273 338.7442 364.6517 372.7060 377.2319 388.2066 399.6538 405.6025 419.9696 431.5813 459.6390 476.9428 497.9202 511.5000 518.7190 554.1172 564.8134 578.3195 587.8028 596.1173 624.0311 699.2445 729.3668 729.5854 764.4126 798.2029 806.9297 825.4064 845.1287 858.4104 863.2874 884.9288 910.4599 918.4701 925.3729 929.1010 948.4316 959.3844 974.7938 990.1432 1017.4994 1024.4629 1026.7793 1038.4354 1038.9346 1046.2939 1066.5439 1076.3033 1089.1133 1106.1392 1112.0255 1118.0454 1139.6711 1149.5281 1153.3953 1161.4462 1167.9841 1181.1121 1191.3720 1204.1150 1222.9623 1226.6465 1245.5203 1248.0674 1276.8779 1308.4741 1310.2719 1318.0349 1321.5567 1330.7027 1337.8275 1371.0216 1374.4438 1394.4482 1396.6220 1401.3959 1402.2040 1421.7606 1430.1736 1434.1515 1446.9581 1448.4514 1449.0881 1456.1695 1456.5010 1457.0437 1459.4523 1463.2971 1470.7098 1471.4665 1474.4100 1477.5416 1483.8512 1489.7679 1514.0679 1538.5277 1581.9733 1627.1706 1641.1184 1677.5717 1685.0114 2943.0768 2959.5305 2966.9137 2968.5528 2974.9380 2978.6357 2985.0892 2999.0312 3000.7963 3001.7018 3017.6425 3025.9618 3027.0946 3037.2539 3042.1581 3047.2420 3058.7317 3067.0740 3076.6630 3089.4697 3093.1941 3094.8622 3104.1584 3111.8015 3112.9850 3139.2487 3140.2183 3144.9792
redmass: 3.7466 3.5715 2.8568 4.4432 7.0117 5.4360 2.9557 1.6445 3.1602 5.2892 3.4167 4.1577 4.0155 1.9613 1.9322 2.4755 1.5148 1.2619 1.6339 1.6321 2.0420 2.9612 2.8594 3.7276 4.2544 3.4224 3.9735 4.5301 2.6001 3.9515 3.9676 4.3328 3.7647 2.9430 2.2307 3.7880 4.9744 3.7234 3.9997 5.0025 3.6865 3.6391 2.9136 3.2924 2.7120 2.5042 3.9707 3.4061 5.1079 4.4598 5.6135 3.5482 6.4256 2.3103 3.5020 3.0544 4.2407 2.2805 4.7751 1.6940 4.4768 1.6932 2.5440 2.0124 2.7596 2.4569 1.7153 1.3020 2.3884 2.1713 1.6985 2.0886 1.6945 1.8817 1.5411 2.1425 2.0526 5.1247 2.7874 1.2398 1.2455 3.0221 1.7240 2.2259 1.5354 1.6349 1.6019 1.2259 2.2280 1.3513 1.1585 1.9510 2.9879 1.5210 1.7201 3.0988 1.4599 1.4814 4.8876 1.4466 1.4896 1.3500 1.3235 1.3074 1.2411 1.2973 1.5870 1.1893 1.2149 1.0891 1.0956 1.0590 1.0892 1.0783 1.0631 1.0780 1.0833 1.0733 1.0686 1.0607 1.0699 1.0883 1.0566 1.0776 7.9976 9.0052 8.8505 6.8420 8.5160 6.6628 6.7183 1.0643 1.0395 1.0685 1.0425 1.0632 1.0643 1.0419 1.0578 1.0369 1.0638 1.0271 1.0962 1.0935 1.0959 1.0963 1.0988 1.0962 1.0894 1.0895 1.0920 1.0929 1.0941 1.0950 1.1005 1.1041 1.1060 1.1058 1.1062
irintensity: 0.5250 0.1564 0.3407 0.3005 1.0531 0.9393 2.5065 0.4427 2.6646 0.6714 4.4782 0.6802 1.7010 9.9898 6.3578 2.9713 1.9589 1.5971 3.8671 0.5126 1.0527 4.2630 0.7226 4.2226 3.2711 1.8055 0.2676 15.4606 1.1816 1.2042 2.6443 4.0246 0.5167 1.7341 2.9647 3.1191 19.6232 3.0632 8.4145 16.6798 19.4799 0.2619 0.4653 2.4472 7.4629 15.2368 5.0372 11.7287 24.2802 2.6529 2.1651 5.4705 11.0145 3.7879 2.2846 5.6858 2.5835 16.3145 15.9969 60.5609 33.0195 9.3283 17.7461 1.7451 2.2489 11.1566 18.8248 62.6248 23.1131 25.2134 2.8386 63.4762 19.7985 5.4023 2.1989 2.4908 81.5490 32.2864 15.3901 1.9381 5.5576 28.0649 14.1407 135.2125 5.1497 16.7670 45.9108 52.5154 43.8437 0.5268 8.2415 11.8741 216.1514 19.0715 52.7961 4.6440 6.6584 43.8293 21.5284 0.8800 1.6559 1.8240 0.6520 16.6822 37.2946 49.2915 14.6794 15.5505 64.6948 34.5329 11.3535 26.3495 20.3661 1.3303 7.7640 18.7835 11.8662 3.7131 35.5575 23.2624 5.2407 36.8993 23.5581 2.3230 97.7693 150.6155 202.2666 178.4751 5.8169 14.1746 3.9764 46.2107 33.6126 907.9100 77.5939 49.8459 11.5387 9.9114 12.7468 74.2501 16.2499 44.4328 14.8871 35.2641 29.6684 33.8599 13.1592 14.3347 14.1739 10.5687 14.0604 36.2167 10.8685 25.9141 7.2172 17.0676 19.1959 10.5134 8.2289
temp: 298.150 k
press: 1.00000 atm
elementType: 8 8 8 8 8 8 6 6 6 6 6 6 6 6 6 6 6 6 6 6 6 6 6 6 6 6 6 1 1 1 1 1 1 1 1 1 1 1 1 1 1 1 1 1 1 1 1 1 1 1 1 1 1 1 1
symmnumber: 1
zpe: 1174232.4 jmol-1
zpe.correction: 0.447242 hartree
zpe.thermalcorrener: 0.477609 hartree
zpe.thermalcorrenthalpy: 0.478553 hartree
zpe.thermalcorrgfe: 0.384900 hartree
zpe.sumelectzpe: -1266.248031 hartree
zpe.sumelectthermal: -1266.217664 hartree
zpe.sumelectthermalent: -1266.216720 hartree
zpe.sumelectthermalfe: -1266.310373 hartree
dipole: -0.9651 -0.2629 0.0457
dipole: 1.0013
quadrupole: -147.9237 -153.9012 -161.7209
quadrupole: 0.4424 5.4468 5.5808
quadrupole: 6.5916 0.6141 -7.2056 0.4424 5.4468 5.5808
hfenergy: -1266.6952729 hartree
pointgroup: C01 [X(C21H28O6)]
dipole: -0.3927563 0.0266553 -0.0153482 debye
polarizability: 282.8043259|-11.592464|236.0740741|31.3417727|-3.0787619|254.5760491 unknown
InChI: InChI=1S/C21H28O6/c1-13(7-6-8-14(2)10-12-17(22)23)9-11-16-15(3)18(24)20(26-4)21(27-5)19(16)25/h8-9,22H,6-7,10-12H2,1-5H3
charge 0 multiplicity 1
55 atoms
O  2.408079 -0.053722 -2.321786
O  3.439126 -0.773892 0.100617
O  0.400934 2.022647 -2.354623
O  3.111963 1.022792 2.26017
O  1.600522 -2.563931 0.879936
O  0.25172 -1.725084 -0.816216
C  -3.910584 1.112967 0.656116
C  -4.353722 -0.242693 0.016632
C  -2.883815 1.926241 -0.131424
C  -0.659426 3.277755 -0.045945
C  0.608593 2.440189 0.010479
C  -1.799821 2.435956 0.522031
C  1.366715 2.270897 1.14846
C  -3.252251 -1.253887 -0.242716
C  -3.01445 -2.413789 0.43773
C  -1.96352 -3.411343 -0.056301
C  0.968014 1.722441 -1.255774
C  -3.187497 2.151227 -1.600264
C  2.453723 1.233325 1.182885
C  2.028872 0.65341 -1.213787
C  2.68352 0.408814 -0.018315
C  -0.63047 -3.434969 0.737471
C  1.131685 3.003306 2.447863
C  -3.779847 -2.856555 1.674841
C  0.418553 -2.481152 0.176259
C  1.453443 -0.379617 -3.416978
C  4.874748 -0.668193 0.466497
H  -4.830914 1.726695 0.773609
H  -3.521853 0.919164 1.673857
H  -5.133153 -0.677688 0.669742
H  -4.855205 -0.023826 -0.948359
H  -0.855541 3.569745 -1.08921
H  -0.542762 4.201496 0.550813
H  -1.687435 2.188545 1.588772
H  -2.596148 -1.037584 -1.099445
H  -1.727297 -3.206165 -1.1155
H  -2.405735 -4.42733 -0.010121
H  -3.188809 1.192451 -2.153789
H  -2.454032 2.808192 -2.092607
H  -4.195902 2.593032 -1.727085
H  -0.779287 -3.186011 1.805261
H  -0.176894 -4.44507 0.730072
H  2.089661 3.170585 2.967323
H  0.616056 3.964822 2.296441
H  0.515426 2.390999 3.134867
H  -4.387595 -3.759245 1.462537
H  -3.080264 -3.13444 2.488295
H  -4.452586 -2.077544 2.069297
H  0.527704 -0.783471 -2.979215
H  1.980116 -1.154004 -3.994773
H  1.248733 0.511567 -4.027154
H  5.234129 -1.706635 0.519634
H  4.97536 -0.164405 1.440377
H  5.40924 -0.1211 -0.329492
H  2.337979 -1.942411 0.534895
