program: Gaussian 09
title: 000134774
version: EM64L-G09RevD.01
frameworkgroup: C1[X(C10H18N2O9)]
method: RPBEPBE
basis: SDD
operation: Freq
keyword: #p
keyword: freq=noraman
keyword: PBEPBE/SDD
title: #p freq=noraman PBEPBE/SDD
converged: YES YES NO NO
title: Mulliken charges:
elementType: O O O O O O O O O N N C C C C C C C C C C H H H H H H H H H H H H H H H H H H
charge: -0.455016 -0.463808 -0.458383 -0.408355 -0.254885 -0.422573 -0.219289 -0.403870 -0.241045 -0.391981 -0.398354 -0.130169 -0.124661 -0.450853 -0.056001 -0.444654 -0.148657 0.237192 -0.407082 0.159118 0.184338 0.267187 0.191967 0.206702 0.277550 0.266733 0.221373 0.209577 0.295921 0.301249 0.302514 0.368052 0.273916 0.240561 0.345805 0.369485 0.388575 0.385047 0.386777
chargesum: 0.00000
title: Mulliken charges with hydrogens summed into heavy atoms:
elementType: O O O O O O O O O N N C C C C C C C C C C
charge: -0.086964 -0.118003 -0.088898 -0.019781 -0.254885 -0.037526 -0.219289 -0.017093 -0.241045 -0.125248 -0.095840 0.137018 0.067306 0.033399 0.165372 0.060843 0.152592 0.237192 0.107395 0.159118 0.184338
polarizability: 1.83016971e+02 5.33939583e+00 1.42060228e+02 -4.75684395e+00 5.92635700e+00 1.33598282e+02
1716.lowfreq: -16.8408 -4.4867 -3.4181 -0.0004 0.0004 0.0006 11.7313 20.3456 29.5874
frequency: 9.7327 20.2680 29.5821 39.4254 46.9534 52.0334 54.9929 66.7539 82.1580 93.6888 108.6590 115.9497 137.3251 147.9276 159.2966 191.7028 205.3669 235.2070 251.1914 253.8341 255.2976 277.7124 299.0706 321.9462 363.8974 378.4551 406.1280 421.7632 431.9380 460.8531 484.4754 502.0104 527.3316 545.4459 569.8702 590.8923 594.3935 599.1987 638.2745 639.6074 651.6003 697.6664 705.1738 742.7772 796.5735 803.1137 810.9005 867.4290 875.3417 903.3290 941.4025 979.1660 986.8434 989.3154 1025.5175 1039.0786 1044.1649 1051.2077 1061.3778 1067.0908 1085.0135 1095.1647 1132.7782 1158.8264 1164.1039 1167.9727 1184.2653 1227.6780 1241.1256 1248.0840 1264.1984 1266.5417 1276.3418 1282.7021 1291.1086 1300.8384 1302.8437 1319.4775 1330.3666 1363.9110 1373.5112 1377.3651 1379.1666 1397.7203 1416.1264 1456.6905 1457.0128 1468.3305 1472.1639 1478.4995 1658.4432 1664.5467 1670.2149 2872.1291 2897.2969 2912.4153 2953.4563 2959.4660 2989.4151 3041.9150 3063.0600 3070.9970 3079.2639 3222.4559 3437.1932 3508.1635 3511.4443 3518.2547 3518.5346 3543.2369 3577.5033
redmass: 5.7227 8.1325 6.4325 5.7887 5.9140 7.1430 7.6034 4.9134 7.5354 4.6331 5.6171 4.5263 3.8899 4.0906 5.3353 3.2965 2.7403 1.3063 3.1737 2.6622 2.8747 4.5633 5.8163 2.4098 4.5298 2.5039 3.6021 4.5189 4.4688 2.4083 3.8329 1.9327 2.3271 1.9198 3.1249 2.4602 2.0283 3.5095 2.1824 1.4370 1.2854 3.8550 3.6208 5.4286 1.4792 2.4517 3.9266 2.5746 3.6829 3.7694 2.3521 2.4619 4.5775 2.3751 3.7963 2.9897 2.5813 2.9592 2.6895 2.2583 2.4680 2.8092 2.4491 2.5789 2.7394 1.3054 1.1480 1.2249 1.4131 1.2788 1.4421 1.4196 1.2626 1.3489 1.2316 1.5791 1.4204 1.3121 1.4465 1.4719 1.5204 1.5033 1.3965 1.2774 1.5451 1.2105 1.2257 1.1489 1.1739 1.0892 7.8231 8.2130 9.2345 1.0825 1.0711 1.0702 1.0683 1.0838 1.0846 1.0873 1.0918 1.0851 1.0948 1.0632 1.0745 1.0758 1.0637 1.0641 1.0641 1.0649 1.0664
irintensity: 0.6504 0.2624 1.1756 9.0118 1.4699 3.3940 0.9013 3.1946 2.1831 6.9024 2.8199 4.5324 1.9062 5.0825 2.6569 16.4050 13.4696 125.3396 6.4051 13.9135 12.5067 19.7208 1.3249 20.2206 15.6218 142.2448 13.4174 21.9074 16.3438 41.1818 27.0031 26.6817 8.1452 73.7050 24.9301 23.9325 124.2852 50.3436 143.0782 92.2488 111.6996 4.1410 22.4959 33.5595 99.1823 45.9669 27.6508 14.5475 14.1379 14.6555 47.5974 64.9401 36.3216 11.4880 48.5537 79.1010 366.7254 109.9955 101.3380 82.3067 46.2976 149.8776 1.1629 95.7094 58.3974 9.3680 17.9042 28.2782 16.9824 6.1127 11.8678 12.4907 10.1181 29.4555 30.1973 65.4837 11.4282 4.4440 47.1403 48.1623 23.9762 26.6938 24.4426 24.1257 62.9279 8.1927 13.7361 21.0345 9.5598 25.1597 186.8445 220.8051 239.7082 83.8809 60.8395 94.2977 57.6699 43.2879 30.0289 10.6628 3.3634 16.7592 13.1438 210.1164 13.4963 0.7052 40.9206 33.1918 24.5915 21.8623 7.6317
temp: 298.150 k
press: 1.00000 atm
elementType: 8 8 8 8 8 8 8 8 8 7 7 6 6 6 6 6 6 6 6 6 6 1 1 1 1 1 1 1 1 1 1 1 1 1 1 1 1 1 1
symmnumber: 1
zpe: 785342.5 jmol-1
zpe.correction: 0.299121 hartree
zpe.thermalcorrener: 0.323220 hartree
zpe.thermalcorrenthalpy: 0.324164 hartree
zpe.thermalcorrgfe: 0.241025 hartree
zpe.sumelectzpe: -1176.682817 hartree
zpe.sumelectthermal: -1176.658718 hartree
zpe.sumelectthermalent: -1176.657774 hartree
zpe.sumelectthermalfe: -1176.740912 hartree
dipole: 1.0737 1.9485 -4.7605
dipole: 5.2547
quadrupole: -121.2868 -122.1140 -117.3281
quadrupole: 17.6386 15.5238 0.3129
quadrupole: -1.0438 -1.8710 2.9148 17.6386 15.5238 0.3129
hfenergy: -1176.9819379 hartree
pointgroup: C01 [X(C10H18N2O9)]
dipole: -0.2751672 -1.1297489 -1.709382 debye
polarizability: 181.2229447|10.2848282|141.2209888|5.4435749|-6.4171457|136.2315468 unknown
InChI: InChI=1S/C10H18N2O9/c13-4(1-11-3-6(15)16)7(9(18)19)12-2-5(14)8(17)10(20)21/h4-5,7-8,11-15,17-18,20H,1-3H2
charge 0 multiplicity 1
39 atoms
O  -2.490979 2.103157 -0.10697
O  4.586256 0.566921 -1.199945
O  3.348236 0.819803 1.349139
O  0.901643 2.610533 1.389449
O  -0.020551 0.505034 1.675064
O  3.634555 -2.599342 0.036195
O  5.021139 -1.408223 1.476207
O  -6.100149 -2.327467 1.056787
O  -6.031597 -1.296114 -1.027365
N  0.804617 0.842657 -1.319644
N  -3.44988 -0.344823 -0.522129
C  -0.158928 1.657894 -0.54518
C  -1.60823 1.234009 -0.872484
C  2.206317 1.289727 -1.385642
C  3.184106 0.139547 -1.040087
C  -1.96919 -0.248004 -0.555703
C  3.070893 -0.284883 0.445217
C  0.189659 1.500954 0.946229
C  -3.999736 -1.379584 0.367292
C  4.020334 -1.448944 0.733206
C  -5.459868 -1.629414 0.034095
H  -0.084667 2.742319 -0.774601
H  -1.755699 1.415997 -1.966255
H  2.47048 1.68245 -2.394901
H  2.369902 2.108124 -0.662641
H  0.423073 0.492972 -2.202573
H  2.964065 -0.742712 -1.676243
H  -1.497835 -0.938251 -1.287174
H  -1.577857 -0.494144 0.44467
H  2.030701 -0.596969 0.635618
H  -3.898137 -0.375812 -1.449305
H  -3.3204 1.53551 0.004067
H  -3.910142 -1.079135 1.42646
H  -3.482086 -2.365083 0.277169
H  4.721807 0.94399 -2.104547
H  4.328651 0.976641 1.336535
H  1.322534 2.40282 2.268298
H  4.28027 -3.33252 0.226633
H  -7.042811 -2.515635 0.79726
