program: Gaussian 09
title: 000139476
version: EM64L-G09RevD.01
frameworkgroup: C1[X(C2H4Cl3OP)]
method: RPBEPBE
basis: SDD
operation: Freq
keyword: #p
keyword: freq=noraman
keyword: PBEPBE/SDD
title: #p freq=noraman PBEPBE/SDD
converged: YES YES NO NO
title: Mulliken charges:
elementType: Cl Cl Cl P O C C H H H H
charge: -0.202421 0.041077 0.000048 0.955809 -0.538436 -0.765488 -0.773702 0.327701 0.303241 0.339590 0.312580
chargesum: 0.00000
title: Mulliken charges with hydrogens summed into heavy atoms:
elementType: Cl Cl Cl P O C C
charge: -0.202421 0.041077 0.000048 0.955809 -0.538436 -0.134546 -0.121531
polarizability: 9.38934585e+01 -9.18425069e+00 7.85165248e+01 1.13517623e+00 -6.47870988e+00 6.01815379e+01
1716.lowfreq: -0.3909 -0.0043 -0.0028 -0.0024 5.0485 8.7801 45.1010 55.6650 93.8218
frequency: 45.0964 55.6057 93.8103 117.4105 183.2397 193.0755 212.4904 258.1171 342.3020 414.1465 588.0761 639.6629 691.0892 730.6189 818.5731 834.5568 1028.6138 1114.8411 1146.6914 1219.0599 1236.1465 1388.6184 1393.2071 3065.1352 3074.8926 3161.9450 3176.2738
redmass: 6.5238 7.4500 9.4365 8.0901 13.3992 4.9854 3.4834 11.4076 9.7314 11.7246 6.7132 6.5498 7.5392 6.1796 1.5650 1.5394 5.2004 1.0459 1.1389 1.1359 1.1382 1.0723 1.0714 1.0538 1.0545 1.1115 1.1125
irintensity: 2.4841 5.8433 2.0452 6.9433 2.1884 4.2686 0.5824 5.6818 39.8126 82.0038 27.3394 33.1174 10.8017 4.1851 21.8115 11.9054 65.9101 4.1854 8.2636 6.9514 5.0886 4.0534 9.3570 4.6011 1.1992 0.6465 0.6044
temp: 298.150 k
press: 1.00000 atm
elementType: 17 17 17 15 8 6 6 1 1 1 1
symmnumber: 1
zpe: 162831.5 jmol-1
zpe.correction: 0.062019 hartree
zpe.thermalcorrener: 0.071598 hartree
zpe.thermalcorrenthalpy: 0.072542 hartree
zpe.thermalcorrgfe: 0.024598 hartree
zpe.sumelectzpe: -1874.659434 hartree
zpe.sumelectthermal: -1874.649855 hartree
zpe.sumelectthermalent: -1874.648911 hartree
zpe.sumelectthermalfe: -1874.696855 hartree
dipole: 2.4352 -0.8258 -3.4958
dipole: 4.3397
quadrupole: -73.7764 -70.2000 -75.7906
quadrupole: 4.3567 -0.1368 0.5709
quadrupole: -0.5207 3.0556 -2.5349 4.3567 -0.1368 0.5709
hfenergy: -1874.7214531 hartree
pointgroup: C01 [X(C2H4Cl3O1P1)]
dipole: 0.9179965 0.5391196 1.3348255 debye
dipolederiv: -0.452204 -0.1967152 0.09679 -0.15392 -0.6472815 0.2137071 0.1310819 0.2429251 -0.4347326 -0.3959996 0.1116428 -0.0185058 0.0784065 -0.0967863 -0.0033735 -0.0284332 0.0094933 -0.0813677 -0.3875306 -0.1783386 -0.0157621 -0.2322688 -0.3251246 -0.0086505 -0.0168532 -0.0108072 -0.1100035 1.284326 0.2431782 -0.1231824 -0.1288176 1.4156602 -0.2436771 -0.152605 -0.1158291 1.24624 -0.5762313 0.0026539 0.0347361 0.0769103 -0.5354703 0.0335103 0.0343933 0.0298085 -0.5984911 0.4194313 -0.2492639 0.0474202 -0.0202209 -0.0886894 -0.0234818 0.0773624 -0.0616927 -0.0883285 0.1669909 0.3214034 -0.0137765 0.4074049 0.1861976 -0.0050784 -0.0138781 -0.0672689 -0.0995054 -0.0386599 0.0047905 0.0094069 -0.0019151 0.0101961 0.022845 0.035344 -0.0240307 0.1020336 -0.0199321 0.0365017 -0.0458512 0.0542435 0.0512906 0.0033257 -0.0292657 -0.005954 -0.028493 -0.0139219 -0.0079412 0.0251263 -0.0143943 0.0016885 -0.0303466 -0.0183455 -0.0115736 0.1002712 0.0137312 -0.0879117 0.0035985 -0.0654285 0.0283189 0.0412198 -0.018801 0.0149292 -0.0076231 unknown
polarizability: 91.9046314|10.4700592|79.2021381|-1.3458445|-8.221549|61.4847516 unknown
InChI: InChI=1S/C2H4Cl2OP.Cl/c3-1-6(5)2-4;/h1-2H2;
charge 0 multiplicity 1
11 atoms
Cl -0.923378 -2.1477 0.805949
Cl -2.64293 1.164506 0.205387
Cl 2.672781 1.096363 0.349195
P  0.01194 -0.346764 -0.270693
O  -0.061081 -0.369718 -1.860334
C  -0.837152 1.101186 0.604288
C  1.734799 -0.515591 0.491213
H  -0.379297 2.037315 0.25295
H  -0.727188 0.975848 1.690217
H  2.286455 -1.283662 -0.068976
H  1.650951 -0.769382 1.555704
