program: Gaussian 09
title: 000138219
version: EM64L-G09RevD.01
frameworkgroup: C1[X(C10H12)]
method: RPBEPBE
basis: SDD
operation: Freq
keyword: #p
keyword: freq=noraman
keyword: PBEPBE/SDD
title: #p freq=noraman PBEPBE/SDD
converged: YES YES NO NO
title: Mulliken charges:
elementType: C C C C C C C C C C H H H H H H H H H H H H
charge: -0.215209 -0.478023 -0.476481 -0.441029 0.416272 -0.399806 -0.403057 -0.230792 -0.230531 -0.245179 0.240312 0.223951 0.220517 0.220825 0.223667 0.225152 0.210280 0.233700 0.234656 0.222360 0.222344 0.226072
chargesum: 0.00000
title: Mulliken charges with hydrogens summed into heavy atoms:
elementType: C C C C C C C C C C
charge: 0.025103 -0.033555 -0.031989 -0.005597 0.416272 -0.166106 -0.168401 -0.008432 -0.008187 -0.019107
polarizability: 1.34606681e+02 -8.04674399e-03 1.05539913e+02 5.99872641e+00 -1.23111176e-01 6.07556254e+01
1716.lowfreq: -17.3936 -0.0008 -0.0005 0.0004 3.5840 10.4433 27.7820 101.7661 146.5852
frequency: 26.6300 101.7581 146.5785 179.3661 306.7626 402.2590 409.2094 427.8595 550.0982 615.3363 640.6390 704.5560 729.2658 764.0238 786.2673 852.2874 858.9314 906.9464 917.5573 932.1872 953.1720 974.3207 988.3956 991.4998 1000.0190 1019.8677 1030.6504 1086.1498 1104.7269 1166.0946 1171.1458 1187.5857 1199.1717 1208.7822 1227.2363 1227.7400 1236.0792 1246.3699 1316.9659 1319.6166 1375.5946 1432.1850 1453.8564 1462.4049 1478.7375 1484.3482 1587.8339 1613.6169 2971.6781 3009.0793 3010.3471 3021.5114 3074.9723 3082.0242 3101.8359 3116.0236 3119.3772 3132.8831 3142.0697 3160.2943
redmass: 2.7820 2.8721 3.2108 2.2491 3.6881 2.8573 3.3743 3.2103 2.3097 6.4360 3.2946 1.8269 1.8183 1.6221 1.1874 1.2467 2.2888 1.7081 1.8199 1.8212 1.5241 1.3943 5.8654 1.3105 3.5332 2.3522 2.0110 1.6256 2.2567 1.3001 1.0665 1.1203 1.3769 1.1214 1.3729 1.6357 1.4956 1.3542 1.3683 1.9001 7.6596 2.2473 1.0875 1.0849 1.1354 2.3367 6.1346 6.0722 1.0834 1.0577 1.0565 1.0650 1.1068 1.1077 1.1073 1.0843 1.0872 1.0917 1.0963 1.1015
irintensity: 0.0607 0.3349 0.0660 1.2887 0.4955 0.0351 0.2461 3.7835 11.5312 0.1214 5.8550 48.3428 24.1438 32.3169 1.8911 0.0248 3.1326 3.4989 1.1288 7.0125 0.0119 0.0729 0.1432 0.1221 3.6526 1.7001 6.0863 6.4782 0.6027 2.4743 0.5573 0.1598 1.2375 0.0056 0.3102 1.1176 7.9196 4.9604 0.9546 8.2411 0.3943 6.8140 3.8826 5.9487 2.9542 19.1406 1.5386 14.0803 15.5531 62.9658 23.6391 35.3569 20.6186 18.0173 85.4371 7.1809 0.5827 16.8283 50.7388 23.0764
temp: 298.150 k
press: 1.00000 atm
elementType: 6 6 6 6 6 6 6 6 6 6 1 1 1 1 1 1 1 1 1 1 1 1
symmnumber: 1
zpe: 494923.7 jmol-1
zpe.correction: 0.188506 hartree
zpe.thermalcorrener: 0.197171 hartree
zpe.thermalcorrenthalpy: 0.198115 hartree
zpe.thermalcorrgfe: 0.153852 hartree
zpe.sumelectzpe: -387.502524 hartree
zpe.sumelectthermal: -387.493859 hartree
zpe.sumelectthermalent: -387.492915 hartree
zpe.sumelectthermalfe: -387.537178 hartree
dipole: 0.5313 -0.0047 0.1003
dipole: 0.5407
quadrupole: -56.4406 -56.0872 -62.9912
quadrupole: -0.0010 1.8562 -0.0636
quadrupole: 2.0657 2.4191 -4.4848 -0.0010 1.8562 -0.0636
hfenergy: -387.6910302 hartree
pointgroup: C01 [X(C10H12)]
dipole: 0.2088798 0.0050551 -0.0398775 debye
dipolederiv: 0.0680164 0.002247 -0.0547356 -0.0089602 0.012386 -0.0062268 0.0615515 -0.0050456 0.1378182 -0.0514222 -0.0133911 -0.0622004 -0.0874845 0.0572194 0.086914 -0.0751288 0.0255302 0.1165592 -0.0514246 0.0173268 -0.0583493 0.0955543 0.072341 -0.0935922 -0.0620582 -0.0310901 0.1048457 0.0377015 -0.0012448 0.0343032 0.0013877 -0.0240629 -0.0110832 -0.0220067 -0.0118004 0.1961505 0.3811021 0.0077084 -0.0603407 0.0161851 -0.0687742 -0.0024019 -0.2204028 -0.0039816 -0.0348324 -0.1909554 0.0552934 -0.0217089 0.1315986 0.0522858 -0.0115888 0.0331933 -0.0002217 -0.1584447 -0.1865646 -0.0582087 -0.0263466 -0.1402406 0.0445848 0.02457 0.0232243 0.0146352 -0.1563133 0.0213401 -0.0436658 -0.0361636 -0.0741576 0.0961476 0.0239457 -0.0266738 0.0140936 -0.1450941 0.0193107 0.0445631 -0.0330175 0.0746904 0.1006889 -0.0093071 -0.021401 0.0005609 -0.14623 0.0398541 0.0032226 -0.0437859 0.0031899 -0.1027558 0.0016582 -0.0358176 0.0017671 -0.1721387 -0.0608005 -0.0032222 0.0512115 -0.0021009 0.059259 0.0115737 0.0369496 0.0105609 -0.1411924 0.0372435 0.0364575 0.0172431 0.0590683 -0.1320066 -0.0962019 0.0309006 -0.1309717 0.00025 0.0429704 -0.0607159 0.0799402 -0.0365407 0.0186631 0.0492526 0.0742905 0.0758819 -0.0896434 0.0410369 0.0522814 0.0862145 0.0289534 0.0319358 -0.0345903 0.0779744 -0.0623313 -0.1011528 0.0385178 -0.0340143 0.0111596 -0.0584655 -0.1556283 0.0802904 0.0220819 0.1156022 0.0220321 -0.0796577 0.0039029 -0.1044332 0.008357 0.0642286 0.0073536 -0.1812491 0.0066051 -0.0966871 -0.0815939 -0.0061471 0.0947768 -0.0093052 0.061861 0.0074559 0.1585683 0.0081279 -0.0676172 0.0472715 -0.108033 0.017412 -0.1004962 -0.0579933 0.0063505 0.0137697 0.0051215 0.1368104 0.0432976 0.1083889 0.0247151 0.102095 -0.0515041 -0.0181544 0.0202819 -0.0169039 0.1353026 0.0107647 0.0920747 0.0209498 0.1099188 -0.0794321 -0.0232261 0.0234917 -0.0241084 0.1509432 0.0155257 -0.0906133 0.0147774 -0.1089537 -0.0862504 0.0086476 0.0161245 0.0095259 0.153046 -0.1415341 -0.0042106 0.0483787 -0.0042934 0.0868065 -0.0016394 0.0523358 -0.0015577 0.1555883 unknown
polarizability: 134.5704548|0.4760284|105.4955998|-6.1903156|1.4520003|60.8361646 unknown
InChI: InChI=1S/C10H12/c1-2-5-9(6-3-1)10-7-4-8-10/h1-3,5-6,10H,4,7-8H2
charge 0 multiplicity 1
22 atoms
C  1.351039 0.033653 -0.520766
C  2.282369 -1.086856 0.07339
C  2.2612 1.105678 0.186377
C  3.375376 0.010298 0.320016
C  -0.138652 0.005809 -0.238255
C  -0.869823 1.211791 -0.076672
C  -0.840857 -1.224733 -0.154686
C  -2.263604 1.19034 0.155997
C  -2.234778 -1.250916 0.077841
C  -2.952837 -0.042404 0.233242
H  1.511412 0.092093 -1.617038
H  2.549283 -1.931835 -0.58321
H  1.877213 -1.48192 1.022246
H  1.848387 1.392815 1.170009
H  2.511293 2.018582 -0.379711
H  3.92474 -0.033745 1.274384
H  4.104268 0.05961 -0.508174
H  -0.342313 2.171991 -0.130857
H  -0.29147 -2.166993 -0.269994
H  -2.810748 2.132329 0.279011
H  -2.759539 -2.211442 0.140054
H  -4.033258 -0.060944 0.415694
