program: Gaussian 09
title: 000138198
version: EM64L-G09RevD.01
frameworkgroup: C1[X(C3H6O2)]
method: RPBEPBE
basis: SDD
operation: Freq
keyword: #p
keyword: freq=noraman
keyword: PBEPBE/SDD
title: #p freq=noraman PBEPBE/SDD
converged: YES YES NO NO
title: Mulliken charges:
elementType: O O C C C H H H H H H
charge: -0.166568 -0.166355 -0.462435 -0.287814 -0.286980 0.235603 0.235270 0.221750 0.228179 0.221412 0.227937
chargesum: 0.00000
title: Mulliken charges with hydrogens summed into heavy atoms:
elementType: O O C C C
charge: -0.166568 -0.166355 0.008438 0.162115 0.162369
polarizability: 4.55568676e+01 -1.46416756e-02 3.73769372e+01 7.99137409e-01 1.04056906e-03 3.20836223e+01
1716.lowfreq: -17.3253 -8.9232 -0.0008 -0.0002 0.0005 10.0623 99.0241 304.8523 615.2228
frequency: 98.4062 304.8508 615.2227 658.3578 760.1938 802.9583 853.3949 884.4103 916.4010 947.4971 1009.3343 1123.8565 1162.8353 1173.9453 1212.1712 1266.0561 1300.4030 1327.6162 1455.5706 1456.3311 1482.2471 3001.8941 3002.9587 3033.1395 3075.3267 3086.4470 3107.2570
redmass: 1.7330 3.5949 3.9643 4.1990 6.7600 1.3291 4.9366 5.1556 1.5434 2.7007 3.0534 1.8196 1.2127 1.2366 1.1559 1.2763 1.2146 1.2387 1.0879 1.0863 1.0937 1.0585 1.0592 1.0617 1.1044 1.1060 1.1079
irintensity: 4.0115 6.5764 4.6859 1.1398 7.7580 2.3674 5.9224 2.1447 11.8764 6.3219 2.3554 2.3077 0.9094 1.4083 1.3284 13.6448 13.7604 0.0829 2.7183 3.1986 6.2068 101.5959 0.1229 28.7349 7.0208 0.4912 58.0013
temp: 298.150 k
press: 1.00000 atm
elementType: 8 8 6 6 6 1 1 1 1 1 1
symmnumber: 1
zpe: 233984.1 jmol-1
zpe.correction: 0.089120 hartree
zpe.thermalcorrener: 0.093936 hartree
zpe.thermalcorrenthalpy: 0.094880 hartree
zpe.thermalcorrgfe: 0.061235 hartree
zpe.sumelectzpe: -267.855203 hartree
zpe.sumelectthermal: -267.850388 hartree
zpe.sumelectthermalent: -267.849444 hartree
zpe.sumelectthermalfe: -267.883088 hartree
dipole: 0.0013 3.8315 0.0129
dipole: 3.8316
quadrupole: -26.8269 -33.3550 -29.5474
quadrupole: -0.0054 -0.6015 -0.0036
quadrupole: 3.0828 -3.4452 0.3624 -0.0054 -0.6015 -0.0036
hfenergy: -267.9443232 hartree
pointgroup: C01 [X(C3H6O2)]
dipole: 0.3141437 -1.4590799 -0.211706 debye
dipolederiv: -0.1982971 -0.1505986 -0.0712393 0.0140302 -0.312103 -0.0291486 -0.0191201 -0.0380461 -0.2375415 -0.2761894 0.184555 -0.0235518 0.0087794 -0.2442565 -0.0053795 -0.0297134 0.0129083 -0.225457 -0.2241362 -0.043314 -0.0225094 -0.0288525 -0.0241287 -0.0307014 -0.1035219 -0.0472104 0.142836 0.3098641 0.0370461 0.0733526 -0.0686579 0.2218496 -0.0257046 0.136581 0.0115788 0.3396298 0.2966984 -0.0192241 0.0575973 0.0644958 0.2293277 0.0181775 0.155762 0.0158167 0.345123 0.084192 0.0217354 0.013871 0.0077134 0.0178069 -0.0763033 0.0246338 -0.1217693 -0.0886787 0.0819959 0.0242491 -0.0225968 0.0370884 -0.0462827 0.0866776 -0.0278404 0.1325604 -0.0211299 -0.0090647 0.0043651 -0.0737184 0.0404937 0.015694 0.012093 -0.1613797 0.0195462 -0.1358014 -0.0525491 0.0092659 0.0818351 0.0171668 0.0875331 0.0054914 0.0984758 0.0286777 0.0109849 -0.0047036 0.0066568 -0.0729539 -0.0032453 0.0182557 0.0010403 -0.1558666 -0.0427125 -0.1438025 -0.0078104 -0.0747367 0.0599136 -0.089012 0.0363039 0.0437575 0.0819895 0.0286503 0.0138373 unknown
polarizability: 44.9705059|1.8706348|37.7190111|-1.6786146|0.388651|32.3279101 unknown
InChI: InChI=1S/C3H6O2/c1-2-4-5-3-1/h1-3H2
charge 0 multiplicity 1
11 atoms
O  0.438177 1.139741 -0.073213
O  -0.892189 0.756366 0.601071
C  0.250497 -1.274344 -0.067782
C  1.237081 -0.090434 0.149547
C  -1.142229 -0.581336 0.00857
H  0.391126 -1.755749 -1.049631
H  0.378939 -2.037439 0.717668
H  1.652281 -0.086994 1.174354
H  2.048149 -0.042536 -0.597553
H  -1.597795 -0.468822 -0.992622
H  -1.846637 -1.072752 0.701792
