program: Gaussian 09
title: 000138196
version: EM64L-G09RevD.01
frameworkgroup: C1[X(C9H16O)]
method: RPBEPBE
basis: SDD
operation: Freq
keyword: #pfreq=noraman
keyword: PBEPBE/SDD
title: #p freq=noraman PBEPBE/SDD
converged: NO YES NO NO
title: Mulliken charges:
elementType: O C C C C C C C C C H H H H H H H H H H H H H H H H
charge: -0.454499 -0.005513 -0.453420 -0.441946 -0.397425 -0.405975 -0.382500 -0.202051 -0.087647 -0.595499 0.211657 0.186330 0.219447 0.245470 0.178302 0.196111 0.191717 0.193283 0.197052 0.197558 0.186502 0.191992 0.250239 0.341359 0.219277 0.220178
chargesum: 0.00000
title: Mulliken charges with hydrogens summed into heavy atoms:
elementType: O C C C C C C C C C
charge: -0.113140 0.206143 -0.047643 -0.018174 -0.009598 -0.015639 0.001560 -0.010059 0.162592 -0.156044
polarizability: 1.15424591e+02 -1.00317867e+01 9.67620397e+01 4.24628108e+00 -3.10214068e+00 8.10143072e+01
1716.lowfreq: -23.0916 -0.0010 -0.0005 0.0002 3.2662 15.0115 59.2931 80.4821 110.1249
frequency: 59.1497 80.3600 110.1091 173.9398 227.1677 261.0592 280.2249 330.2143 343.1653 374.5295 393.1953 430.1358 440.8278 490.3111 563.9012 691.2788 787.9792 794.6264 836.9066 882.3064 889.2791 896.1480 911.7620 957.3878 962.0379 974.7098 1012.4706 1049.5249 1054.4288 1064.1479 1076.0543 1100.4270 1112.0881 1156.3960 1184.6690 1210.1512 1249.5435 1255.9625 1261.4795 1265.1737 1288.2814 1292.2786 1305.1356 1329.0684 1333.6690 1339.1885 1341.3741 1351.6139 1367.2155 1429.7830 1462.4279 1463.4987 1465.0946 1471.5195 1479.9906 1648.2327 2933.8971 2951.9200 2954.9175 2963.4051 2964.7828 2965.0866 2971.8786 3024.3956 3025.3460 3030.9505 3038.6273 3062.7723 3082.3834 3096.5102 3193.8759 3553.8901
redmass: 3.2237 2.9330 2.8898 3.0104 1.7821 2.3685 2.8593 1.2153 1.6701 2.5528 3.7886 2.8986 1.9302 2.2617 2.1599 1.8345 1.4833 2.1330 2.0838 2.2652 1.7187 1.7138 1.7956 1.3137 2.4974 2.4664 1.1673 1.8355 1.1559 1.8925 1.4218 1.9225 2.5192 2.1023 1.5486 1.3993 1.2535 1.2920 1.2657 1.3167 1.1767 1.2510 1.2885 1.4428 1.3761 1.5020 1.4841 1.4113 1.5537 1.2252 1.0902 1.0869 1.0892 1.0829 1.0946 4.6001 1.0828 1.0724 1.0668 1.0602 1.0666 1.0622 1.0744 1.0962 1.0972 1.0985 1.1025 1.0947 1.0620 1.0912 1.1139 1.0662
irintensity: 0.3724 0.2335 0.0468 2.0176 0.3824 2.6679 3.3088 112.4576 18.5876 1.4967 16.2944 0.2970 0.3658 3.5684 7.6978 9.4426 0.1293 3.1735 9.6710 15.8869 18.3022 2.7514 3.3534 73.3720 72.5819 24.2362 15.1604 1.1505 1.2594 20.9800 0.4136 2.3863 0.1471 1.2470 2.1569 10.2954 10.1254 6.6907 10.9702 1.0467 0.2840 11.8248 1.9976 0.1295 0.2626 2.5213 1.1111 7.9461 2.2500 15.8823 3.9536 2.3946 10.8631 20.0919 3.3634 6.4653 23.8382 7.6696 17.8101 34.7973 23.0663 24.6836 98.6906 86.8480 68.8763 3.2122 115.5145 33.0840 15.6826 6.3225 25.5984 4.0823
temp: 298.150 k
press: 1.00000 atm
elementType: 8 6 6 6 6 6 6 6 6 6 1 1 1 1 1 1 1 1 1 1 1 1 1 1 1 1
symmnumber: 1
zpe: 606376.5 jmol-1
zpe.correction: 0.230957 hartree
zpe.thermalcorrener: 0.241629 hartree
zpe.thermalcorrenthalpy: 0.242574 hartree
zpe.thermalcorrgfe: 0.195004 hartree
zpe.sumelectzpe: -426.942146 hartree
zpe.sumelectthermal: -426.931473 hartree
zpe.sumelectthermalent: -426.930529 hartree
zpe.sumelectthermalfe: -426.978099 hartree
dipole: 0.9624 -1.0673 0.5643
dipole: 1.5439
quadrupole: -57.5830 -66.0714 -61.0422
quadrupole: -0.3629 1.1877 1.2765
quadrupole: 3.9825 -4.5058 0.5233 -0.3629 1.1877 1.2765
hfenergy: -427.1731028 hartree
pointgroup: C01 [X(C9H16O1)]
dipole: -0.3790532 0.4193341 0.2223797 debye
dipolederiv: -0.3788303 -0.0973378 -0.1270599 -0.0786723 -0.8662212 -0.0131159 -0.2089295 0.0216052 -0.466913 0.0065861 -0.0449821 0.0052748 0.076796 -0.0190796 0.007147 0.0071674 0.0551458 0.1356256 -0.0344929 -0.0269371 0.0190632 0.012555 0.0329138 -0.0044774 0.0262523 0.0285942 0.1438972 -0.0514359 0.0197595 0.0118788 -0.0738209 0.0301531 0.02561 0.0528516 -0.0278208 0.1515444 0.0620116 0.0196833 0.0003433 -0.0024562 0.079992 0.0285032 -0.0298374 -0.0021028 0.1595829 0.0542592 -0.0178623 0.0124221 0.0210831 0.0600108 -0.007158 -0.0447709 0.0273559 0.1568948 0.0647104 0.0056568 -0.0226003 0.008083 0.0268323 0.0043519 0.0192453 0.0079246 0.1503664 0.4283169 0.1378958 0.0442175 0.1411341 0.5895254 0.0846768 0.0972177 -0.013986 0.3345022 -0.0818145 -0.1292541 -0.0271319 -0.2804994 -0.1171102 -0.0217889 0.0355537 0.006505 0.1108784 -0.2773257 -0.1306089 0.0744293 -0.1341067 -0.2624562 -0.0310415 0.0678587 -0.0502096 0.0778465 0.0454546 0.0010101 0.0017767 0.0102246 0.0340067 -0.0108687 -0.0120046 -0.0121647 -0.172208 0.0463308 -0.0176789 0.0229152 -0.0224078 0.0492374 0.0103138 0.0320358 -0.0498259 -0.1815203 -0.0426797 0.1170889 -0.0533938 0.1285521 -0.0724977 0.0389165 -0.0623185 0.0598117 0.037552 0.0841477 -0.0633926 -0.0084568 -0.0541811 -0.1239368 -0.0215457 -0.0020537 -0.0461982 0.0702713 0.0233827 0.0196297 0.0269338 0.0219769 0.0721114 -0.0520678 0.0139859 0.0221493 -0.1940616 -0.0101702 -0.0711064 -0.0085112 -0.0930826 -0.2095691 -0.0309646 -0.0229135 -0.0677717 0.0647086 0.0220973 0.0143544 -0.0096252 0.027518 0.0737407 -0.038894 0.0227591 0.0321891 -0.20008 0.0494118 -0.0306952 -0.0071213 -0.034073 0.0462083 -0.0105007 0.0515162 -0.0637788 -0.1951187 -0.1109956 0.1292929 -0.0487268 0.1235579 -0.0960638 0.0574148 -0.07703 0.0848454 0.0424843 -0.2382675 -0.0501865 0.0596854 -0.0517404 0.0314927 0.0149566 0.0967886 0.0220761 0.053885 0.0835111 0.0152961 0.0188089 0.0097336 0.01692 -0.0165395 -0.0571101 -0.0306802 -0.2017324 0.003415 -0.0068804 0.0019594 -0.0166127 -0.0259551 -0.0474454 -0.0219642 -0.0334604 -0.2075513 0.0953718 0.0522721 0.0249241 0.0504893 0.1144292 -0.0105984 -0.0343532 0.0224982 -0.1068669 -0.0111524 -0.0333279 0.0845277 -0.0051719 0.3363254 -0.0217182 0.1194143 -0.0405415 0.3044444 0.0331361 0.1411594 -0.0529912 0.1656988 0.0717233 0.0444784 -0.0652753 0.0512626 0.0453432 0.1350217 0.0471513 -0.0435418 0.0494225 0.1272674 0.0223557 -0.0040857 -0.0034223 -0.1137748 unknown
polarizability: 115.4550053|-9.9582627|96.7087533|-4.4112429|3.074945|81.037179 unknown
InChI: InChI=1S/C9H16O/c1-2-9(10)8-6-4-3-5-7-8/h2,8-10H,1,3-7H2
charge 0 multiplicity 1
26 atoms
O  -1.721138 -1.879721 -0.18691
C  0.039107 -0.2142 -0.235116
C  0.492295 1.222487 0.129485
C  1.025493 -1.256596 0.351825
C  1.942611 1.494345 -0.337585
C  2.476078 -0.98893 -0.115007
C  2.928251 0.448444 0.235377
C  -1.408355 -0.485196 0.234087
C  -2.431987 0.450685 -0.372055
C  -3.28782 1.223148 0.344009
H  0.046303 -0.315904 -1.342366
H  0.434933 1.350561 1.232006
H  -0.195833 1.968131 -0.312404
H  0.700327 -2.272325 0.06698
H  0.983231 -1.202072 1.461192
H  2.25043 2.516043 -0.041049
H  1.980228 1.458198 -1.446499
H  2.537627 -1.132222 -1.214157
H  3.161868 -1.729477 0.340884
H  3.950915 0.634925 -0.146783
H  2.972268 0.556525 1.339355
H  -1.453634 -0.411849 1.344507
H  -2.469752 0.449601 -1.472188
H  -2.674953 -2.054708 0.01932
H  -4.026902 1.870824 -0.140814
H  -3.265991 1.236584 1.441606
