program: Gaussian 09
title: 000138190
version: EM64L-G09RevD.01
frameworkgroup: C1[X(C6H12O)]
method: RPBEPBE
basis: SDD
operation: Freq
keyword: #pfreq=noraman
keyword: PBEPBE/SDD
title: #p freq=noraman PBEPBE/SDD
converged: YES YES NO NO
title: Mulliken charges:
elementType: O C C C C C C H H H H H H H H H H H H
charge: -0.456543 -0.090136 -0.367310 0.379122 -0.680379 -0.780654 -0.786146 0.189027 0.247948 0.209157 0.233449 0.223596 0.219275 0.232377 0.217671 0.220015 0.226242 0.227265 0.336025
chargesum: 0.00000
title: Mulliken charges with hydrogens summed into heavy atoms:
elementType: O C C C C C C
charge: -0.120517 0.098891 -0.119363 0.379122 -0.014178 -0.111332 -0.112624
polarizability: 9.37048944e+01 4.13606451e+00 6.26823266e+01 -8.07975905e-01 2.95847446e-01 5.76456608e+01
1716.lowfreq: -2.4902 -0.0006 -0.0006 -0.0005 10.8370 19.1288 49.7726 117.8828 132.7881
frequency: 49.4661 117.8823 132.7703 191.1629 200.2279 226.3723 296.3254 339.2860 392.5190 407.7190 456.9048 495.4073 508.7203 809.1210 845.0167 862.7442 920.5853 949.6045 994.3816 1027.2476 1057.4759 1067.8367 1082.9470 1144.9820 1213.1340 1234.9535 1287.6999 1332.1577 1371.0291 1383.9568 1389.9399 1400.6892 1455.5308 1457.0712 1465.8063 1472.5010 1473.5785 1476.8224 1686.2796 2961.1626 2967.1314 2972.4487 2991.0703 3033.0894 3036.7659 3081.8882 3086.8001 3094.1554 3095.1379 3097.1810 3550.9207
redmass: 2.8869 2.0493 1.1378 1.1646 1.5254 1.5876 2.6043 1.1356 2.5277 2.4824 2.7306 2.3961 3.2447 2.9452 2.8247 1.3700 1.8641 1.4217 1.2471 2.0786 1.5876 1.7014 1.6768 2.1622 2.0461 1.2536 1.3359 1.4196 1.6611 1.2504 1.2743 1.2137 1.0500 1.0502 1.0507 1.0647 1.0469 1.0708 6.3880 1.0374 1.0424 1.0796 1.0352 1.0969 1.0963 1.0948 1.0933 1.0985 1.0986 1.0988 1.0660
irintensity: 0.5325 0.2566 0.0826 1.5010 0.1242 4.7904 8.2818 136.6367 2.2099 16.1843 1.9606 3.4689 5.7363 0.7844 29.2678 20.2268 12.8102 1.0798 6.4880 51.0590 18.6992 47.7794 4.2730 2.0932 20.1721 49.5148 2.2457 9.8975 18.6264 24.3278 26.5503 13.3724 2.8540 4.6025 13.2420 15.9663 29.0749 2.3426 15.4131 32.0295 27.1576 67.4286 20.0667 5.9252 45.2636 4.1322 29.2571 7.6759 55.9314 47.8373 5.5076
temp: 298.150 k
press: 1.00000 atm
elementType: 8 6 6 6 6 6 6 1 1 1 1 1 1 1 1 1 1 1 1
symmnumber: 1
zpe: 434517.2 jmol-1
zpe.correction: 0.165499 hartree
zpe.thermalcorrener: 0.174912 hartree
zpe.thermalcorrenthalpy: 0.175857 hartree
zpe.thermalcorrgfe: 0.131569 hartree
zpe.sumelectzpe: -310.454660 hartree
zpe.sumelectthermal: -310.445246 hartree
zpe.sumelectthermalent: -310.444302 hartree
zpe.sumelectthermalfe: -310.488589 hartree
dipole: 2.5688 0.6309 0.1253
dipole: 2.6481
quadrupole: -48.8334 -43.3092 -43.1783
quadrupole: -0.9726 -2.6274 -0.0890
quadrupole: -3.7264 1.7978 1.9286 -0.9726 -2.6274 -0.0890
hfenergy: -310.6201587 hartree
pointgroup: C01 [X(C6H12O1)]
dipole: -1.0110652 0.1991284 -0.1534267 debye
dipolederiv: -0.5954755 -0.1351482 -0.2544405 -0.2357859 -0.5170735 0.0068075 -0.3052317 0.0048019 -0.6717963 0.5257499 -0.0018958 0.1172697 0.1667076 0.3500169 0.0596515 0.1112905 0.0153923 0.6779759 -0.2064353 -0.0302211 -0.0511532 0.0051241 -0.0525081 -0.1116345 0.0103077 -0.0650026 -0.3507954 0.348135 0.0116559 0.0088069 -0.0591516 0.2350524 -0.1473408 0.0296919 -0.1634289 -0.064875 -0.1103726 0.0466915 0.0989273 -0.0299084 0.037993 -0.0688174 0.0182382 -0.057951 -0.0367559 -0.0938571 -0.0907965 0.030961 -0.0268911 -0.034846 0.0539754 0.0068773 0.0564055 0.0899656 -0.0406794 0.031619 -0.0190277 -0.0062263 -0.126033 0.0877743 -0.0205926 0.1026258 0.0609507 0.0112599 0.062973 -0.0434018 0.0462896 -0.1902155 0.0782575 -0.0084749 0.0550748 -0.0489478 0.0430784 0.0253746 -0.0029818 -0.0009125 -0.1037318 0.0917361 0.0247044 0.0866038 0.1262075 0.0575074 0.0048836 -0.1192683 0.0096562 0.0917713 0.0018193 -0.0839264 -0.0094082 -0.1101069 -0.1484319 -0.0789506 0.0543369 -0.090941 0.0365062 0.0066862 0.049263 0.0011862 0.0990568 0.0938969 0.0201619 0.0199239 0.0631632 -0.1264294 0.0364319 -0.0148317 0.0866427 0.0682407 -0.0436424 -0.0363149 -0.0907372 -0.0581397 0.0924329 0.0117455 -0.1492269 -0.0323047 -0.0724523 0.0648616 0.0914318 -0.0346272 0.0068214 -0.1183981 0.0803256 -0.002847 0.0821819 0.0754436 -0.0523285 0.0303425 0.0933658 0.055942 0.0334951 -0.1012261 0.1531407 -0.0561697 -0.0114399 -0.0294474 0.1000083 0.0925288 0.1015586 0.028175 -0.0239393 0.1229248 -0.0869133 -0.0030543 0.0244247 0.0126726 -0.1124503 0.0134706 0.0632824 -0.0362659 -0.1432347 0.0221514 -0.0819478 -0.0292998 -0.1629016 0.0406279 -0.1053801 -0.0117828 0.0327645 0.025935 0.0248175 0.0892822 0.1810561 0.0984142 0.1713398 0.1446034 0.312293 -0.0587511 0.1759923 -0.0667052 0.1650485 unknown
polarizability: 93.7019725|-4.1068803|61.3807092|1.0204739|-2.2142043|58.9502001 unknown
InChI: InChI=1S/C6H12O/c1-5(2)4-6(3)7/h4,6-7H,1-3H3
charge 0 multiplicity 1
19 atoms
O  2.082264 0.296433 1.186417
C  1.278707 0.254562 -0.069625
C  -0.01747 -0.485631 0.175165
C  -1.291796 -0.027734 -0.003649
C  2.184396 -0.442603 -1.094522
C  -2.485844 -0.915872 0.309592
C  -1.656517 1.35309 -0.523306
H  1.082799 1.294504 -0.402814
H  0.124525 -1.510217 0.552562
H  1.705379 -0.455928 -2.089293
H  3.149737 0.088504 -1.167359
H  2.385242 -1.482567 -0.782376
H  -3.119429 -1.059311 -0.588248
H  -2.175575 -1.910587 0.672861
H  -3.132515 -0.45149 1.080668
H  -2.355417 1.856604 0.173291
H  -2.183938 1.273621 -1.494613
H  -0.784486 2.010824 -0.669274
H  1.482138 0.577001 1.924323
