program: Gaussian 09
title: 000138168
version: EM64L-G09RevD.01
frameworkgroup: C1[X(C8H20N2)]
method: RPBEPBE
basis: SDD
operation: Freq
keyword: #pfreq=noraman
keyword: PBEPBE/SDD
title: #p freq=noraman PBEPBE/SDD
converged: YES YES NO NO
title: Mulliken charges:
elementType: N N C C C C C C C C H H H H H H H H H H H H H H H H H H H H
charge: -0.096727 -0.096728 -0.296959 -0.297213 -0.296959 -0.297214 -0.688398 -0.669575 -0.688397 -0.669574 0.182494 0.204280 0.173752 0.199379 0.182495 0.204279 0.173753 0.199380 0.227584 0.210121 0.206038 0.211574 0.237911 0.195738 0.227584 0.210121 0.206039 0.211573 0.237911 0.195738
chargesum: 0.00000
title: Mulliken charges with hydrogens summed into heavy atoms:
elementType: N N C C C C C C C C
charge: -0.096727 -0.096728 0.089815 0.075919 0.089815 0.075919 -0.044654 -0.024353 -0.044654 -0.024352
polarizability: 1.12977237e+02 1.72024278e-05 1.00247889e+02 -2.16856125e-01 2.35424330e-05 1.00053450e+02
1716.lowfreq: -2.8878 -0.0006 -0.0004 -0.0003 8.1017 21.3825 61.6326 69.7763 88.5069
frequency: 61.6189 69.5875 88.5065 93.2644 109.7382 144.7885 179.9972 197.9800 218.6818 230.9103 269.0512 276.4363 288.2655 299.7919 339.8002 419.5587 475.8431 486.8183 549.6908 647.3861 773.2540 791.4964 798.9577 803.6262 830.4577 930.5711 934.7398 949.4636 1022.9088 1048.4419 1062.2244 1068.6550 1083.5290 1089.4896 1102.9228 1115.3022 1155.9393 1176.3934 1182.7196 1200.5809 1276.8444 1284.1283 1285.8171 1293.0173 1348.6841 1348.9305 1362.0516 1367.8507 1373.7640 1380.3991 1386.5493 1386.6172 1454.1274 1455.4823 1458.2266 1462.0167 1465.3098 1470.1757 1474.7494 1477.6273 1485.0683 1487.5801 1488.4735 1497.8991 2856.0859 2856.7910 2869.6165 2879.3116 2982.4111 2982.8767 2984.8201 2986.0291 3019.7409 3021.9846 3028.8473 3028.8665 3074.7449 3074.9289 3079.5556 3081.9657 3090.7756 3091.0503 3100.1746 3101.1010
redmass: 2.8251 2.4230 1.7214 1.8558 2.2641 2.4967 1.2122 1.2916 1.1841 1.2477 1.6479 2.5051 2.1804 1.7989 3.0869 2.9248 2.7852 2.7047 3.7686 3.2040 1.6544 1.1603 1.1645 1.1304 1.5340 1.8965 1.8535 2.1051 2.4636 2.7484 2.0363 2.2045 1.9630 2.0123 1.9020 1.9939 1.9050 2.1287 2.5998 2.4223 1.1128 1.2929 1.1578 1.1806 1.2995 1.2951 1.4271 1.2695 1.2407 1.3176 1.2147 1.2224 1.0439 1.0603 1.0523 1.0658 1.0499 1.0588 1.0601 1.0618 1.0519 1.0606 1.0663 1.0602 1.0714 1.0718 1.0693 1.0705 1.0358 1.0357 1.0356 1.0358 1.0877 1.0890 1.0860 1.0858 1.0983 1.0981 1.0997 1.0991 1.1004 1.1004 1.0996 1.0999
irintensity: 0.0069 0.0375 0.0019 0.3445 0.2110 0.8977 0.6301 0.2317 0.7702 0.2201 0.0238 4.2930 0.5997 3.0830 0.4130 11.2461 1.2864 1.6844 16.6775 4.3043 14.6084 0.0632 0.9158 6.5225 3.3146 1.0297 2.0854 0.8482 15.8688 11.6549 23.5446 4.4712 0.5950 0.1536 29.7161 0.9962 5.0373 0.0545 36.9417 2.0700 9.5626 5.1727 3.1624 12.3831 2.3532 3.2677 10.3076 10.1169 6.7456 32.5846 0.5158 36.3495 1.3622 12.4416 8.5673 0.3873 15.1152 0.0139 0.0167 6.8060 1.4710 18.5652 22.5751 2.7309 105.2893 13.4200 56.7554 199.7258 70.3527 4.6778 21.9249 54.2834 1.9037 20.9877 64.6278 3.8948 34.0524 56.1183 82.9305 5.9120 22.8847 68.8656 1.7834 62.5872
temp: 298.150 k
press: 1.00000 atm
elementType: 7 7 6 6 6 6 6 6 6 6 1 1 1 1 1 1 1 1 1 1 1 1 1 1 1 1 1 1 1 1
symmnumber: 1
zpe: 714962.9 jmol-1
zpe.correction: 0.272315 hartree
zpe.thermalcorrener: 0.286070 hartree
zpe.thermalcorrenthalpy: 0.287015 hartree
zpe.thermalcorrgfe: 0.232718 hartree
zpe.sumelectzpe: -425.429952 hartree
zpe.sumelectthermal: -425.416196 hartree
zpe.sumelectthermalent: -425.415252 hartree
zpe.sumelectthermalfe: -425.469548 hartree
dipole: 0.0000 -1.4743 -0.0001
dipole: 1.4743
quadrupole: -64.4202 -65.9299 -64.4809
quadrupole: -0.0001 1.2137 -0.0001
quadrupole: 0.5235 -0.9862 0.4627 -0.0001 1.2137 -0.0001
hfenergy: -425.7022665 hartree
pointgroup: C01 [X(C8H20N2)]
dipole: -0.0000308 0.0001013 -0.5800537 debye
polarizability: 112.7107915|1.8491945|100.3198959|-0.0002074|-0.0000577|100.2478889 unknown
InChI: InChI=1S/C8H20N2/c1-5-9(6-2)10(7-3)8-4/h5-8H2,1-4H3
charge 0 multiplicity 1
30 atoms
N  -0.730804 -0.009005 -0.061438
N  0.730802 0.009035 -0.061507
C  -1.357218 -0.565907 -1.301822
C  -1.276402 1.311007 0.347923
C  1.357094 0.56637 -1.301757
C  1.276442 -1.31112 0.347343
C  -2.757532 -1.150967 -1.03439
C  -0.928046 1.661234 1.80263
C  2.757417 1.151372 -1.034249
C  0.928242 -1.661849 1.801964
H  -1.419497 0.192929 -2.120736
H  -0.699374 -1.377698 -1.666164
H  -0.923764 2.129235 -0.329953
H  -2.374847 1.256065 0.230388
H  1.419316 -0.192191 -2.120931
H  0.6992 1.378269 -1.665766
H  0.923731 -2.129111 -0.33078
H  2.374875 -1.256136 0.229705
H  -2.704893 -1.918958 -0.24307
H  -3.474621 -0.375923 -0.708708
H  -3.163004 -1.615327 -1.953046
H  -1.366295 0.920207 2.494431
H  0.166912 1.651602 1.93496
H  -1.313869 2.664132 2.065439
H  2.704832 1.919045 -0.242616
H  3.474575 0.376228 -0.708956
H  3.162769 1.616118 -1.952763
H  1.366579 -0.921069 2.493974
H  -0.166701 -1.652243 1.934416
H  1.31408 -2.664844 2.064378
