program: Gaussian 09
title: 000138160
version: EM64L-G09RevD.01
frameworkgroup: C1[X(C13H12S)]
method: RPBEPBE
basis: SDD
operation: Freq
keyword: #pfreq=noraman
keyword: PBEPBE/SDD
title: #p freq=noraman PBEPBE/SDD
converged: YES YES NO NO
title: Mulliken charges:
elementType: S C C C C C C C C C C C C C H H H H H H H H H H H H
charge: -0.020700 -0.840690 0.531030 0.520757 -0.420265 -0.369084 -0.355502 -0.423257 -0.223973 -0.232789 -0.230398 -0.224289 -0.245611 -0.248877 0.294593 0.235595 0.251756 0.255783 0.266845 0.228009 0.227058 0.227786 0.225729 0.111241 0.230299 0.228956
chargesum: 0.00000
title: Mulliken charges with hydrogens summed into heavy atoms:
elementType: S C C C C C C C C C C C C C
charge: 0.090541 -0.546098 0.531030 0.520757 -0.184670 -0.117328 -0.099719 -0.156412 0.004036 -0.005731 -0.002613 0.001440 -0.015312 -0.019921
polarizability: 1.89816932e+02 -8.86706993e+00 1.44927617e+02 -1.44094297e+01 -1.98256629e+00 1.09437181e+02
1716.lowfreq: -7.6497 -2.9521 -0.0023 -0.0017 -0.0002 9.0587 22.9733 46.8520 74.8803
frequency: 22.0099 46.8180 74.8729 112.2659 164.5688 189.2834 222.8851 255.4104 292.0535 327.9664 402.1787 406.4782 450.5568 499.3523 574.3284 607.0512 615.6984 623.8330 651.1185 702.6009 707.1311 751.1701 765.3954 814.3398 843.0774 853.0361 861.6245 883.7171 929.1596 939.2823 978.7311 985.3139 989.7517 990.5752 996.2043 1000.1970 1026.0809 1029.3566 1081.6270 1084.8990 1171.2764 1172.6955 1176.2635 1188.8850 1191.7410 1206.9717 1224.8225 1261.3169 1314.6039 1331.7665 1376.6380 1383.6040 1431.0914 1442.1499 1478.5387 1481.8312 1587.2105 1592.8397 1609.8279 1611.6419 2436.3435 3015.1277 3119.4928 3121.0089 3122.9006 3128.1223 3136.0399 3140.4354 3147.0319 3149.0357 3163.2498 3164.2614
redmass: 4.1039 3.9767 4.6206 5.0084 1.6618 2.4011 3.5030 4.6185 5.8335 6.0858 2.8142 2.8732 3.5815 3.6575 5.3573 3.9758 6.2357 4.4350 4.2175 1.7614 1.9322 1.9510 1.5623 3.4125 4.1370 1.2620 1.2465 1.4658 1.4949 1.4970 1.4169 1.4562 5.2474 5.2262 1.3151 1.3170 2.2587 2.1757 1.6082 1.5819 1.1470 1.0590 2.4411 1.1118 1.1495 1.5550 1.3285 1.7299 1.3388 1.2765 7.2326 8.0894 2.2268 2.1969 2.2301 2.2812 6.0257 6.1469 6.0589 6.1075 1.0382 1.0839 1.0865 1.0847 1.0869 1.0875 1.0914 1.0923 1.0961 1.0955 1.1015 1.1015
irintensity: 0.1906 0.1799 0.2709 0.2508 7.9852 15.3304 4.6875 4.3194 0.2343 0.3290 0.2331 0.0468 4.5007 3.0351 17.0173 13.0546 0.5285 7.1404 38.0346 55.3133 41.8529 45.6600 42.3174 0.4676 3.9570 0.0370 0.2740 7.0769 0.7263 3.4554 0.0911 0.0814 0.6267 0.4116 0.0671 0.4251 3.6437 12.6957 13.9409 4.6738 0.5442 0.1587 1.4975 2.5270 2.1385 4.3705 0.3766 12.3414 2.5230 1.3947 0.5457 0.2279 14.3885 10.8252 14.3362 22.1016 1.3772 0.3897 9.9240 3.5804 19.0188 3.9647 6.3128 2.3842 1.1714 3.3735 12.0293 17.7924 36.4207 24.7442 33.6843 19.9435
temp: 298.150 k
press: 1.00000 atm
elementType: 16 6 6 6 6 6 6 6 6 6 6 6 6 6 1 1 1 1 1 1 1 1 1 1 1 1
symmnumber: 1
zpe: 537307.3 jmol-1
zpe.correction: 0.204650 hartree
zpe.thermalcorrener: 0.216975 hartree
zpe.thermalcorrenthalpy: 0.217919 hartree
zpe.thermalcorrgfe: 0.164355 hartree
zpe.sumelectzpe: -899.655633 hartree
zpe.sumelectthermal: -899.643308 hartree
zpe.sumelectthermalent: -899.642363 hartree
zpe.sumelectthermalfe: -899.695928 hartree
dipole: 0.3666 -1.6970 0.3558
dipole: 1.7722
quadrupole: -81.3088 -92.2827 -85.6778
quadrupole: -1.4334 -2.9499 0.2607
quadrupole: 5.1143 -5.8596 0.7453 -1.4334 -2.9499 0.2607
hfenergy: -899.8602824 hartree
pointgroup: C01 [X(C13H12S1)]
dipole: -0.1318517 -0.6709505 -0.1363356 debye
dipolederiv: -0.3652121 0.017875 0.0402458 -0.1077019 -0.3208828 0.11868 0.1036779 0.2557354 0.0016935 0.3965188 -0.0449548 0.0398093 -0.0721507 0.4885343 -0.0648144 0.1676434 -0.2843987 0.161985 0.0464513 0.1449015 -0.0240688 0.2790463 0.0309409 0.0065431 -0.0388119 0.0183886 -0.0520685 0.1278587 -0.126355 -0.0375225 -0.1208595 -0.1299991 0.0342057 -0.2037462 0.1315481 -0.0425119 -0.1664567 -0.0175865 0.0127508 -0.0198817 -0.0880136 0.1248539 -0.0345111 0.1017045 0.0327517 -0.1107518 0.1411303 -0.0695089 0.0994885 -0.0511453 -0.0407629 -0.0477144 -0.0713927 -0.0894376 -0.0694486 -0.0353002 -0.0610628 -0.0477476 -0.1610605 0.0198543 -0.0952399 0.0118989 -0.0396951 -0.2093884 -0.0141884 -0.0048193 0.0548359 0.0045161 -0.0463095 0.0112657 -0.0442335 -0.1247787 0.0368625 0.0370155 -0.1147839 0.0191558 -0.09882 0.0271851 -0.1104388 0.0149221 0.0221616 -0.0525993 -0.0402385 -0.0348639 -0.039249 0.0889701 -0.0644887 -0.0304371 -0.0652325 -0.1098222 -0.0605892 0.0400666 0.005214 0.0707797 -0.0439052 0.1164324 0.024402 0.1207722 0.0683267 0.0503115 0.0588737 -0.1094855 0.0852939 -0.0139547 -0.0686575 -0.0969444 -0.0701348 -0.0782079 0.0085436 0.0862791 0.0129157 0.0874553 -0.1045708 0.0514369 0.004839 0.0405658 -0.0786307 0.0093647 -0.0784487 -0.0686428 -0.0711715 -0.0405046 -0.0033897 -0.0494519 -0.0087682 -0.1377515 -0.0119652 0.0524658 0.0462939 0.0450993 -0.0057537 -0.0073019 -0.0009263 -0.030435 -0.0550402 0.1014252 -0.0402602 -0.0425083 -0.0324375 0.0583689 -0.1131939 -0.0160425 -0.0937081 -0.0272616 0.0139237 -0.07008 0.0866228 -0.0955213 0.0577743 0.0333596 0.102486 0.0444733 0.0803032 0.0202677 -0.0106437 0.0968311 -0.0051588 0.1033712 -0.0030377 0.1387646 -0.0112186 0.0286116 0.1707705 0.0185238 0.0054004 -0.0117962 -0.0131862 0.0481485 -0.0020146 0.044897 0.1201251 -0.035826 -0.0284463 0.1167804 -0.0270528 0.1303031 -0.0243457 0.128508 -0.0191895 -0.0037409 0.0747482 0.0330153 0.0153793 0.0561871 -0.1094379 0.0711009 0.0141189 0.0684388 0.1227357 0.079975 -0.0341362 -0.0034577 -0.0488075 0.0696577 -0.111681 -0.0284126 -0.1193159 -0.0506791 -0.0499629 -0.0572315 0.094171 -0.074491 0.0399793 0.0669275 0.1075719 0.0645705 0.091228 0.1414261 -0.0159175 -0.0475649 -0.0049273 -0.0114069 -0.1246371 -0.1015751 -0.0529771 -0.0719807 -0.0685283 -0.1155395 -0.016246 -0.1266942 0.0764892 -0.0403798 -0.0168722 -0.0420087 0.0969999 -0.0777189 0.0991803 0.0621204 0.108307 0.0437362 -0.005728 0.0698615 -0.0049018 0.1346846 unknown
polarizability: 185.7601624|10.8460458|145.6289843|-21.4218164|0.8616922|112.7925835 unknown
InChI: InChI=1S/C13H12S/c14-13(11-7-3-1-4-8-11)12-9-5-2-6-10-12/h1-10,13-14H
charge 0 multiplicity 1
26 atoms
S  -0.226202 2.895427 -0.182842
C  0.000232 1.122759 0.552531
C  -1.268694 0.314215 0.311008
C  1.303465 0.428722 0.129836
C  -2.307868 0.315684 1.275184
C  1.483157 -0.93632 0.488428
C  -1.451786 -0.419966 -0.890439
C  2.363022 1.09907 -0.526356
C  -3.506001 -0.396573 1.046641
C  2.687739 -1.609077 0.193517
C  -2.650738 -1.127471 -1.123661
C  3.568851 0.423523 -0.828187
C  -3.683128 -1.118929 -0.156094
C  3.737978 -0.93193 -0.470016
H  0.064442 1.36574 1.630032
H  -2.180105 0.885545 2.203852
H  0.673212 -1.472737 0.996244
H  -0.647406 -0.445516 -1.635044
H  2.2373 2.153246 -0.794644
H  -4.298574 -0.387539 1.803199
H  2.806652 -2.66029 0.479849
H  -2.779094 -1.689191 -2.055857
H  4.375602 0.960263 -1.340452
H  -0.624094 2.468601 -1.439419
H  -4.612465 -1.670726 -0.336117
H  4.672607 -1.454331 -0.702994
