program: Gaussian 09
title: 000138146
version: EM64L-G09RevD.01
frameworkgroup: C1[X(C10H18O2)]
method: RPBEPBE
basis: SDD
operation: Freq
keyword: #pfreq=noraman
keyword: PBEPBE/SDD
title: #p freq=noraman PBEPBE/SDD
converged: YES YES NO NO
title: Mulliken charges:
elementType: O O C C C C C C C C C C H H H H H H H H H H H H H H H H H H
charge: -0.256370 -0.366930 0.437001 -0.095207 -0.508684 -0.537626 -0.449147 -0.451522 -0.393539 -0.385880 -0.407841 -0.408150 0.199840 0.195943 0.231096 0.226414 0.204934 0.222739 0.187109 0.191129 0.218752 0.189893 0.227370 0.192267 0.196742 0.203892 0.185148 0.189456 0.205041 0.356129
chargesum: 0.00000
title: Mulliken charges with hydrogens summed into heavy atoms:
elementType: O O C C C C C C C C C C
charge: -0.256370 -0.010800 0.437001 0.104633 -0.081645 -0.106279 -0.039299 -0.041641 0.023724 0.003129 -0.018802 -0.013654
polarizability: 1.19665200e+02 -1.31288365e+00 1.14568710e+02 1.43765195e+00 2.03143845e-01 9.55847039e+01
1716.lowfreq: -9.3097 -0.0006 -0.0002 0.0003 22.8775 25.6944 80.9212 126.3825 139.0409
frequency: 80.8670 126.3784 139.0238 162.6253 174.9449 206.6620 277.4586 297.7948 302.9336 312.7827 339.5438 401.2201 409.9422 448.9089 499.0962 499.3931 540.5889 585.9799 680.8104 745.6920 797.1900 821.7060 834.6438 840.5555 860.1712 879.0713 880.1466 902.8707 933.3218 984.8229 985.2400 1012.3222 1034.0124 1059.5029 1090.5434 1100.9544 1128.6322 1130.1126 1140.2715 1144.0758 1155.0624 1160.6356 1225.3412 1231.1351 1244.8273 1259.7391 1267.6714 1284.7728 1293.9685 1322.8194 1331.7145 1333.9200 1336.8111 1341.5468 1346.7397 1347.6364 1350.1498 1358.8701 1449.4033 1457.0242 1460.0199 1461.1626 1467.5062 1469.5819 1473.6297 1477.7035 2932.3406 2958.0242 2961.2603 2970.8020 2974.9694 2976.1680 2979.3364 2980.3523 2989.8241 3024.6534 3026.5630 3031.8643 3037.8838 3040.4880 3045.8822 3046.4571 3056.1913 3479.1870
redmass: 3.9129 2.6761 2.7616 2.5043 1.4704 2.2412 2.9226 3.1152 2.4900 2.3909 1.7306 3.5479 3.2040 2.6635 1.9401 2.4152 2.6827 2.0816 4.1366 2.3063 1.4868 6.6240 1.8880 2.7461 2.2370 2.1538 1.4660 2.5454 1.4495 1.9218 2.1003 1.4440 2.4371 1.4842 1.3513 1.6672 1.5660 2.6726 2.2172 1.8736 1.4158 2.2481 1.1878 1.3432 1.4043 1.2304 1.3427 1.2058 1.4787 1.5021 1.4495 1.3309 1.5004 1.4332 1.5386 1.5734 1.4669 1.4578 1.0852 1.0881 1.0846 1.0869 1.0842 1.0818 1.0931 1.0913 1.0813 1.0636 1.0634 1.0633 1.0625 1.0609 1.0632 1.0614 1.0627 1.0964 1.0958 1.0983 1.1014 1.1003 1.0998 1.1008 1.1016 1.0685
irintensity: 8.5859 1.2416 3.3363 56.8835 70.1840 11.0331 1.4570 5.9592 0.8958 2.5256 0.0850 0.1233 0.4046 2.2359 1.5773 3.3975 2.5875 0.9038 1.2442 0.7315 2.2083 12.9536 5.5611 12.1626 9.2425 6.7721 0.6778 0.1281 11.9958 3.0525 8.6683 5.9972 0.1221 1.4054 0.0437 0.3688 1.8788 1.2329 4.5177 2.6008 6.4479 2.8619 38.0457 3.4564 0.2778 0.9318 14.8285 1.3252 1.0086 1.5706 4.3076 0.3234 0.0093 0.6516 2.8447 0.3997 2.0097 1.3904 0.3249 4.8296 6.6813 20.1552 1.4051 25.9149 12.9126 2.2569 13.0378 38.7513 38.4581 9.1905 32.6549 1.4973 34.3934 97.6384 40.9796 81.5345 38.5078 54.2870 8.9179 16.4576 64.0406 35.3010 87.9707 8.7849
temp: 298.150 k
press: 1.00000 atm
elementType: 8 8 6 6 6 6 6 6 6 6 6 6 1 1 1 1 1 1 1 1 1 1 1 1 1 1 1 1 1 1
symmnumber: 1
zpe: 695116.8 jmol-1
zpe.correction: 0.264756 hartree
zpe.thermalcorrener: 0.276594 hartree
zpe.thermalcorrenthalpy: 0.277538 hartree
zpe.thermalcorrgfe: 0.228154 hartree
zpe.sumelectzpe: -541.265951 hartree
zpe.sumelectthermal: -541.254114 hartree
zpe.sumelectthermalent: -541.253169 hartree
zpe.sumelectthermalfe: -541.302553 hartree
dipole: -1.5019 -0.5329 0.9191
dipole: 1.8396
quadrupole: -72.7486 -73.3740 -73.5808
quadrupole: -4.2364 2.3700 -1.0145
quadrupole: 0.4858 -0.1395 -0.3463 -4.2364 2.3700 -1.0145
hfenergy: -541.5307073 hartree
pointgroup: C01 [X(C10H18O2)]
dipole: -0.5923203 0.1911079 -0.369433 debye
polarizability: 119.6466865|1.2902687|114.5728071|-1.4914452|-0.5570803|95.599121 unknown
InChI: InChI=1S/C10H18O2/c11-12-10-7-3-1-5-9(10)6-2-4-8-10/h9,11H,1-8H2
charge 0 multiplicity 1
30 atoms
O  -0.002276 -0.917758 1.1376
O  0.048379 -2.451952 1.136808
C  -0.004003 -0.447369 -0.290765
C  -0.003312 1.108062 -0.126506
C  1.281673 -0.931683 -0.997992
C  -1.289331 -0.929475 -1.001901
C  1.286868 1.612087 0.565971
C  -1.297705 1.615805 0.55531
C  2.563921 -0.41863 -0.304272
C  -2.576344 -0.414283 -0.317157
C  2.557526 1.122132 -0.168302
C  -2.565531 1.127044 -0.184488
H  0.001973 1.493864 -1.171385
H  1.252413 -0.575832 -2.048646
H  1.277458 -2.037094 -1.024877
H  -1.28043 -2.035235 -1.04473
H  -1.259036 -0.567878 -2.04985
H  1.302772 1.252673 1.612805
H  1.267046 2.719771 0.600774
H  -1.277552 2.723291 0.586627
H  -1.319981 1.262609 1.6046
H  3.452718 -0.750855 -0.875005
H  2.631618 -0.875768 0.701269
H  -2.660682 -0.860653 0.694402
H  -3.463257 -0.746027 -0.891019
H  3.462897 1.461445 0.371168
H  2.595788 1.580983 -1.179285
H  -2.594746 1.579516 -1.198225
H  -3.474231 1.471726 0.345915
H  -0.824533 -2.643716 1.583354
