program: Gaussian 09
title: 000138111
version: EM64L-G09RevD.01
frameworkgroup: C1[X(C6H8N2)]
method: RPBEPBE
basis: SDD
operation: Freq
keyword: #p
keyword: freq=noraman
keyword: PBEPBE/SDD
title: #p freq=noraman PBEPBE/SDD
converged: NO NO NO NO
title: Mulliken charges:
elementType: N N C C C C C C H H H H H H H H
charge: -0.118789 -0.386689 0.102420 -0.175609 -0.590699 -0.288878 -0.243901 -0.162438 0.236036 0.262821 0.264136 0.196677 0.222222 0.229809 0.231291 0.221591
chargesum: 0.00000
title: Mulliken charges with hydrogens summed into heavy atoms:
elementType: N N C C C C C C
charge: -0.118789 -0.165098 0.102420 0.060428 0.132935 -0.066655 -0.014092 0.068852
polarizability: 1.03245961e+02 8.30490512e+00 9.22071071e+01 4.09274977e-02 -3.23752070e-02 3.70596659e+01
1716.lowfreq: -15.9058 0.0005 0.0008 0.0009 10.8179 15.0152 123.2473 154.0488 222.7958
frequency: 123.2418 154.0470 222.7951 350.7959 400.6078 440.2336 512.2172 531.3860 588.4183 705.5706 732.5620 736.0988 757.7596 827.3549 855.7692 919.5712 971.1155 1003.8076 1032.3669 1067.8302 1121.0813 1153.7629 1166.1399 1184.5299 1305.9486 1350.0244 1376.8688 1424.2409 1435.7401 1451.0105 1489.0243 1521.6441 1576.4626 1642.4102 2999.5394 3089.9706 3114.8267 3131.2840 3154.8160 3161.5404 3193.5843 3374.9052
redmass: 2.0690 1.3665 3.3075 3.0570 3.1217 3.7383 2.8355 5.0737 6.6352 2.5106 4.3804 1.5121 1.1637 1.4666 5.4295 1.3302 1.3035 2.3460 1.9781 1.4662 1.3307 1.6754 1.0770 2.1525 1.5846 2.4241 1.9902 1.3541 1.0421 1.7190 1.2299 5.8046 4.9848 6.1632 1.0324 1.1004 1.1037 1.0864 1.0962 1.0902 1.1000 1.0759
irintensity: 3.6986 1.9690 2.9235 8.1555 16.6825 1.1479 5.7277 13.6579 0.8252 0.7302 9.7047 14.1385 132.1107 27.7051 8.2639 0.2197 0.3513 12.3324 23.3138 127.8536 1.6217 11.3523 3.4262 22.2192 37.2389 30.9314 2.1280 0.5536 12.8808 22.7758 13.8902 55.5989 146.4888 173.4296 36.4154 12.9980 11.8197 7.2251 16.9636 8.7265 9.5613 11.7690
temp: 298.150 k
press: 1.00000 atm
elementType: 7 7 6 6 6 6 6 6 1 1 1 1 1 1 1 1
symmnumber: 1
zpe: 343046.5 jmol-1
zpe.correction: 0.130660 hartree
zpe.thermalcorrener: 0.137738 hartree
zpe.thermalcorrenthalpy: 0.138682 hartree
zpe.thermalcorrgfe: 0.099572 hartree
zpe.sumelectzpe: -342.326077 hartree
zpe.sumelectthermal: -342.318999 hartree
zpe.sumelectthermalent: -342.318055 hartree
zpe.sumelectthermalfe: -342.357165 hartree
dipole: -1.7456 -1.7505 -0.0045
dipole: 2.4722
quadrupole: -47.8101 -39.4426 -51.5827
quadrupole: -4.7973 -0.0138 -0.0122
quadrupole: -1.5316 6.8359 -5.3042 -4.7973 -0.0138 -0.0122
hfenergy: -342.456737 hartree
pointgroup: C01 [X(C6H8N2)]
dipole: 0.6915359 -0.6839387 0.0022723 debye
dipolederiv: -0.7006744 -0.2242994 -0.0012298 0.7315403 -0.5146452 0.0009202 0.001421 0.0033383 -0.1427749 -0.9798845 0.724868 -0.0005558 0.4390523 -0.4852473 0.0006843 -0.0010145 0.0013572 -0.5222606 0.8621822 -0.6928258 0.0018008 -0.6614276 0.7012606 -0.0018564 0.0020583 -0.0011965 0.1000406 0.7604287 0.307954 0.0003101 -0.3544921 0.0634973 0.0000657 -0.0006545 -0.0008313 -0.0546606 0.330958 0.1349099 0.0029153 0.099473 0.2619632 -0.0010459 0.0012662 -0.0023977 0.1652723 -0.4394875 0.4167529 -0.0005256 -0.0264602 -0.0572565 0.0004845 -0.000757 0.0000994 -0.1623457 -0.3540993 -0.3541975 -0.0002916 -0.0672901 -0.4325421 -0.000091 0.0002183 -0.0001186 -0.2812604 0.1858752 -0.0424593 0.0000667 -0.0359776 0.5835836 0.0000697 0.0003761 -0.000131 -0.0852859 0.0768676 -0.0591243 0.0001224 -0.0192219 -0.070624 0.0000469 0.0000642 0.0000368 0.1623318 0.0079057 -0.0486828 -0.0561089 0.0264749 0.0853729 0.0607186 -0.0879948 0.0098388 -0.0335101 0.0096341 -0.0462316 0.0554019 0.0317427 0.0865703 -0.0631908 0.0854883 -0.0126959 -0.0273785 0.0770687 0.0813434 -0.0015822 -0.0436792 -0.1530849 0.0036644 -0.0004926 0.0029877 0.1143221 0.0578566 0.030521 -0.0000271 -0.0287258 -0.091044 -0.0001144 -0.0003809 0.0002627 0.1674417 -0.0099371 0.0865399 0.0000215 0.0846998 0.0016954 -0.0000275 -0.000098 0.0001835 0.1970502 -0.1018215 -0.0828127 -0.0000999 -0.0788343 0.0612753 -0.0000551 0.0000377 -0.0000826 0.1476413 0.2171275 -0.2322558 -0.0002178 -0.0968742 -0.0407744 -0.0002732 0.0004621 -0.0006506 0.2553767 unknown
polarizability: 103.3605277|-8.2275764|92.0925264|0.0640269|0.006388|37.0596802 unknown
InChI: InChI=1S/C6H8N2/c1-8-5-3-2-4-6(8)7/h2-5,7H,1H3
charge 0 multiplicity 1
16 atoms
N  -0.632431 -0.631262 0.000664
N  -1.694775 1.46447 -0.002857
C  -0.5449 0.800217 -0.000816
C  0.486107 -1.445957 0.000084
C  -1.991931 -1.208188 0.000417
C  0.822696 1.324096 0.000544
C  1.773041 -0.932334 -0.000209
C  1.934328 0.499277 0.000354
H  0.285304 -2.52103 0.000185
H  -2.543333 -0.86764 -0.892353
H  -2.55249 -0.842258 0.877031
H  -1.920563 -2.308232 0.016029
H  0.924525 2.415272 0.001003
H  2.630919 -1.607769 -0.000353
H  2.942026 0.929795 0.000686
H  -1.539524 2.490042 -0.002209
