program: Gaussian 09
title: 000138088
version: EM64L-G09RevD.01
frameworkgroup: C1[X(C10H13Cl)]
method: RPBEPBE
basis: SDD
operation: Freq
keyword: #p
keyword: freq=noraman
keyword: PBEPBE/SDD
title: #p freq=noraman PBEPBE/SDD
converged: NO YES NO NO
title: Mulliken charges:
elementType: Cl C C C C C C C C C C H H H H H H H H H H H H H
charge: -0.077632 0.134412 0.514775 -0.695287 -0.695306 -0.746870 -0.362275 -0.408012 -0.113472 -0.239503 -0.260893 0.210080 0.215533 0.224592 0.215508 0.210080 0.224596 0.220011 0.218931 0.218955 0.273655 0.231994 0.229261 0.256868
chargesum: 0.00000
title: Mulliken charges with hydrogens summed into heavy atoms:
elementType: Cl C C C C C C C C C C
charge: -0.077632 0.134412 0.514775 -0.045083 -0.045122 -0.088972 -0.088620 -0.176017 -0.113472 -0.010243 -0.004025
polarizability: 1.50639005e+02 3.45032226e+00 1.19955031e+02 -4.26082347e-04 -8.69115292e-05 7.05724930e+01
1716.lowfreq: -12.2978 -0.0023 -0.0020 -0.0006 3.5093 10.4990 42.9055 123.7336 157.0728
frequency: 42.5487 123.7335 157.0714 179.6103 205.4712 249.7030 256.6553 308.8458 311.0791 335.4939 340.6192 380.1080 384.1390 444.8556 470.0034 519.3392 585.4102 656.3111 699.4867 740.8664 790.6485 845.2030 895.1479 901.3844 921.0598 933.0419 944.1374 975.4915 983.6976 1018.9364 1024.5391 1073.3269 1094.6337 1121.8197 1182.0220 1205.0472 1216.2347 1265.6408 1296.7635 1369.7978 1375.9304 1376.4644 1404.3167 1412.7097 1459.5102 1460.2839 1463.9565 1473.1059 1481.8077 1487.5335 1498.5257 1570.3655 1606.1926 2974.0442 2975.0715 2980.0480 3069.8792 3070.4495 3071.8048 3078.6095 3080.6937 3083.4971 3126.4935 3148.2715 3174.4642 3179.6140
redmass: 3.3932 2.9974 5.2996 4.7977 1.0628 1.1696 2.3587 1.9159 1.2464 3.0703 3.2720 2.4203 6.7431 3.1084 3.3265 2.8263 4.5957 6.5750 1.9945 5.7129 1.4994 2.6796 1.5100 1.3648 1.6800 1.6390 1.2000 1.3460 5.7347 1.4352 1.3877 2.4898 1.6588 2.0426 1.0881 2.9786 2.7496 2.4441 1.4108 7.7137 1.1851 1.2195 1.2059 2.7837 1.6400 1.0505 1.0483 1.1745 1.1404 1.0500 1.0761 6.4052 6.7812 1.0351 1.0346 1.0358 1.1003 1.0998 1.1003 1.0986 1.0996 1.0991 1.0870 1.0937 1.0964 1.0918
irintensity: 0.0327 0.8723 0.3958 0.0559 0.0061 0.0862 0.2364 0.6282 0.0000 0.1337 1.0626 0.0354 5.2930 5.0508 0.8160 0.2514 0.0318 7.6201 33.2449 26.6974 43.2734 36.1581 8.2776 2.7679 4.1571 2.0517 0.0975 0.2532 5.3279 2.0077 0.2003 25.8783 4.5179 2.7393 0.0444 6.2888 4.0249 48.4753 2.0842 7.5873 18.8469 16.0586 8.0597 23.6937 18.5693 0.0470 0.8958 16.3466 7.3494 12.2910 25.4267 52.9443 34.1533 29.4167 32.6910 25.8296 1.3762 2.7312 23.8320 111.9019 27.6207 49.1334 8.9827 19.3111 7.4867 0.0816
temp: 298.150 k
press: 1.00000 atm
elementType: 17 6 6 6 6 6 6 6 6 6 6 1 1 1 1 1 1 1 1 1 1 1 1 1
symmnumber: 1
zpe: 523567.0 jmol-1
zpe.correction: 0.199416 hartree
zpe.thermalcorrener: 0.210767 hartree
zpe.thermalcorrenthalpy: 0.211711 hartree
zpe.thermalcorrgfe: 0.162460 hartree
zpe.sumelectzpe: -848.097510 hartree
zpe.sumelectthermal: -848.086159 hartree
zpe.sumelectthermalent: -848.085215 hartree
zpe.sumelectthermalfe: -848.134466 hartree
dipole: 2.4324 1.0323 0.0000
dipole: 2.6424
quadrupole: -74.7248 -68.6592 -77.0896
quadrupole: -3.9877 -0.0001 0.0000
quadrupole: -1.2336 4.8320 -3.5984 -3.9877 -0.0001 0.0000
hfenergy: -848.296926 hartree
pointgroup: C01 [X(C10H13Cl1)]
dipole: 0.8887989 0.5392685 0.0002979 debye
dipolederiv: -0.565281 -0.3279928 -0.0001674 -0.4025649 -0.46721 -0.0001762 -0.0001925 -0.0001672 -0.0845081 0.139028 -0.0284372 -0.0000453 -0.1472637 0.1400521 -0.0000127 -0.0002281 0.000035 0.1342656 0.3785028 -0.0686916 0.000132 -0.0204577 0.0142091 0.0000133 0.000196 0.0000037 -0.0858109 -0.0447387 -0.0078553 -0.0383223 0.0363912 0.0079251 -0.0365095 0.0304228 -0.0440804 -0.0174096 -0.0446953 -0.0079415 0.038301 0.0363768 0.0078102 0.0365658 -0.0303189 0.0441069 -0.0172799 -0.0074567 0.030586 0.0000066 0.0249027 -0.0777731 -0.0000779 0.0000098 -0.0000757 0.0412066 -0.4159579 -0.093329 -0.000081 -0.156913 -0.110037 -0.0000037 -0.0001098 -0.0000063 -0.1102158 -0.1582335 0.0915971 0.0000093 0.1824025 -0.0562156 0.00005 0.0000509 0.0000201 -0.1563686 0.7903602 0.4945702 0.0002724 0.6095426 0.6764739 0.0003049 0.0003035 0.0002907 -0.0423654 0.1223794 0.0406251 0.0000628 -0.040377 0.1260666 0.0000758 0.0000302 0.0000917 -0.1473878 -0.1753916 -0.1384312 -0.000055 -0.1598916 -0.2682782 -0.0000638 -0.0000578 -0.0000637 -0.1331921 -0.220236 0.0486599 -0.0368229 0.073232 0.0815637 -0.0045528 -0.0151922 -0.0105765 0.0724168 0.116848 0.0369801 -0.0040401 0.0138299 -0.1656243 -0.0397278 0.0082816 0.0117075 0.068929 0.0690418 -0.0476348 0.0972502 -0.0386575 0.0488258 0.0908099 0.0607333 0.0498483 -0.1011572 0.1168837 0.0370003 0.0040941 0.0138317 -0.1656834 0.0394052 -0.0082315 -0.0119943 0.0689601 -0.2202571 0.0485801 0.0367044 0.0732139 0.0815497 0.0046058 0.015061 0.0106162 0.0724767 0.0691506 -0.0474603 -0.0972029 -0.0385153 0.0490144 -0.0906238 -0.0606564 -0.0496928 -0.101472 -0.1956357 0.0951078 -0.0000202 0.025482 0.0770984 -0.0000086 -0.0000676 0.00001 0.0965997 0.0642186 -0.0723963 0.0932952 -0.0425627 0.0175864 0.0685147 0.0873331 0.0915652 -0.0787631 0.0643247 -0.0721805 -0.0932958 -0.042377 0.0178154 -0.0684024 -0.0872936 -0.0914754 -0.0790996 0.1391695 0.0232908 0.0000034 0.0328711 -0.0293887 -0.0000509 0.000016 -0.0000399 0.1358454 -0.0231625 -0.115725 -0.0000603 -0.1148643 0.0129567 -0.0000449 -0.0000702 -0.000034 0.1376362 0.0505296 0.0384438 -0.0000021 0.0523006 -0.1135928 -0.0000716 0.0000042 -0.0000732 0.1547576 -0.0493912 0.0426345 -0.0000159 0.0300678 0.0948555 -0.0000189 -0.0000236 -0.0000159 0.1719364 unknown
polarizability: 149.0272606|7.6656136|121.5667685|0.0138246|0.0162956|70.5724999 unknown
InChI: InChI=1S/C10H13Cl/c1-10(2,3)8-5-4-6-9(11)7-8/h4-7H,1-3H3
charge 0 multiplicity 1
24 atoms
Cl -3.290604 -1.733361 -0.001043
C  1.886753 -0.26012 0.000184
C  0.387961 0.125818 0.000041
C  2.567889 0.3287 1.273071
C  2.568682 0.330504 -1.271429
C  2.100698 -1.794879 -0.000852
C  -0.644028 -0.848149 -0.000412
C  0.005017 1.497321 0.000403
C  -1.992142 -0.442526 -0.000462
C  -1.351224 1.881028 0.000328
C  -2.378871 0.907869 -0.000097
H  3.644711 0.075807 1.278991
H  2.477856 1.428786 1.31362
H  2.109584 -0.082843 2.190806
H  2.478615 1.430642 -1.310534
H  3.645528 0.077705 -1.276968
H  2.111027 -0.079792 -2.190044
H  3.183186 -2.017542 -0.00067
H  1.662615 -2.270874 0.895861
H  1.663154 -2.269577 -0.898511
H  -0.408936 -1.914938 -0.00074
H  0.775343 2.276518 0.000714
H  -1.620242 2.943036 0.000598
H  -3.434872 1.191966 -0.000155
