program: Gaussian 09
title: 000138085
version: EM64L-G09RevD.01
frameworkgroup: C1[X(C10H6S)]
method: RPBEPBE
basis: SDD
operation: Freq
keyword: #pfreq=noraman
keyword: PBEPBE/SDD
title: #p freq=noraman PBEPBE/SDD
converged: NO YES NO YES
title: Mulliken charges:
elementType: S C C C C C C C C C C H H H H H H
charge: 0.167129 0.285801 -0.199930 -0.199942 0.515848 -0.384744 -0.384737 -0.417067 -0.417069 -0.194667 -0.194668 0.245989 0.245989 0.242337 0.242337 0.223697 0.223697
chargesum: 0.00000
title: Mulliken charges with hydrogens summed into heavy atoms:
elementType: S C C C C C C C C C C
charge: 0.167129 0.285801 -0.199930 -0.199942 0.515848 -0.138755 -0.138748 -0.174730 -0.174732 0.029029 0.029029
polarizability: 1.65489838e+02 5.54072792e-04 1.41762607e+02 5.68318388e-04 -2.68003866e-03 4.54162450e+01
1716.lowfreq: -8.7605 -0.0018 -0.0007 0.0015 8.6260 11.4725 136.2285 204.7807 235.8084
frequency: 136.2251 204.7799 235.8082 304.7456 356.0369 442.6028 447.8987 512.0405 514.0666 551.7115 572.9345 613.7623 627.9434 755.2356 766.3277 800.1158 813.1163 846.9568 893.5931 911.9870 922.2202 968.3957 977.9531 992.4834 1010.0409 1152.2249 1165.9452 1199.8170 1214.6244 1235.1269 1340.3171 1365.5977 1395.1590 1434.9892 1468.4436 1470.0506 1586.0181 1626.7536 1671.1294 3127.6982 3127.7558 3150.5386 3151.5001 3172.1375 3172.6154
redmass: 4.5266 6.2175 3.6405 10.4516 6.1451 4.7511 3.1440 7.3716 7.1411 7.6807 4.4262 3.3349 7.9353 1.1965 2.4286 5.3118 1.9107 6.8297 1.3462 1.4733 6.5182 1.3341 1.3523 2.5897 1.9990 1.6124 1.1792 1.6639 1.5396 1.7538 2.4050 6.5176 1.6918 3.0655 5.2781 3.3988 8.4085 8.7431 9.0265 1.0864 1.0864 1.0952 1.0944 1.0960 1.0959
irintensity: 10.3989 1.0173 0.0000 1.1022 5.1485 0.0000 0.0247 0.1125 0.1651 4.4302 2.9944 0.0000 2.1272 0.0000 57.3386 2.9582 98.5028 7.5188 0.0000 0.0476 27.5070 0.0000 4.4842 6.4703 0.2992 1.1382 0.0013 0.0008 2.8785 2.6741 21.9561 10.7384 0.2669 10.5373 1.4846 16.9827 34.0863 5.0567 9.3134 0.0475 6.7464 12.9129 33.3665 25.3628 0.2065
temp: 298.150 k
press: 1.00000 atm
elementType: 16 6 6 6 6 6 6 6 6 6 6 1 1 1 1 1 1
symmnumber: 1
zpe: 325428.7 jmol-1
zpe.correction: 0.123949 hartree
zpe.thermalcorrener: 0.131755 hartree
zpe.thermalcorrenthalpy: 0.132700 hartree
zpe.thermalcorrgfe: 0.091161 hartree
zpe.sumelectzpe: -781.943484 hartree
zpe.sumelectthermal: -781.935678 hartree
zpe.sumelectthermalent: -781.934734 hartree
zpe.sumelectthermalfe: -781.976273 hartree
dipole: 0.0001 -1.8680 -0.0001
dipole: 1.8680
quadrupole: -56.6965 -66.5812 -76.4655
quadrupole: 0.0003 0.0002 -0.0003
quadrupole: 9.8845 -0.0001 -9.8845 0.0003 0.0002 -0.0003
hfenergy: -782.0674334 hartree
pointgroup: C01 [X(C10H6S1)]
dipole: -0.0000247 -0.7349085 0.0000216 debye
dipolederiv: -0.2492743 -0.0000013 -0.0000025 0.0000015 -0.3817373 -0.0000185 -0.0000005 -0.0000338 0.0256117 -0.0378954 -0.0000225 0.0000011 -0.0000051 -0.5395176 -0.0000213 -0.0000002 -0.0000191 -0.0447378 0.1639659 0.1932834 0.0000103 0.4579474 0.4582335 0.0000336 0.0000291 0.000041 -0.0631675 0.1639348 -0.1932734 -0.0000058 -0.4579289 0.4582675 0.0000253 -0.0000325 0.0000392 -0.0631697 0.1966805 -0.0000027 -0.0000003 -0.0000098 0.0292956 -0.0000041 0.0000007 -0.0000101 0.1155973 -0.0258809 -0.0727583 -0.0000106 -0.2861287 -0.1524107 -0.0000061 -0.0000237 -0.0000113 -0.1409092 -0.0258699 0.0727663 0.0000111 0.2861096 -0.1524208 0.000001 0.0000225 -0.0000091 -0.140909 -0.031125 0.0134238 -0.000002 0.0900723 0.0873313 0.0000074 -0.0000006 0.0000159 -0.1962972 -0.0311379 -0.0134171 0.0000001 -0.0900664 0.0873277 0.0000044 0.0000009 0.000013 -0.1963004 -0.0156107 0.0373246 -0.0000023 0.1302246 0.0830973 0.0000034 0.0000112 0.0000018 -0.1461052 -0.0156088 -0.0373263 0.0000076 -0.1302164 0.0831044 0.0000025 0.000005 0.0000006 -0.1461042 -0.0247603 0.0688714 0.0000044 0.0851381 0.0470923 -0.0000042 0.0000097 -0.0000048 0.1745733 -0.024766 -0.068868 -0.0000075 -0.085136 0.0470966 -0.0000067 -0.0000071 -0.0000075 0.1745728 0.0736525 -0.006288 0.0000001 -0.0539871 -0.1052983 -0.0000071 -0.0000021 -0.0000107 0.1644414 0.0736542 0.0062822 0. 0.0539791 -0.1053007 -0.0000053 0.0000026 -0.0000089 0.1644421 -0.094983 -0.0823951 -0.0000002 -0.0977271 0.0279227 -0.0000026 -0.0000033 0.0000008 0.1592309 -0.0949757 0.0824011 -0.0000036 0.0977327 0.0279166 -0.0000017 -0.0000115 0.0000029 0.1592307 unknown
polarizability: 165.4898376|-0.0002751|141.762607|0.0005683|0.00268|45.416245 unknown
InChI: InChI=1S/C10H6S/c1-3-7-4-2-6-9-10(7)8(5-1)11-9/h1-6H
charge 0 multiplicity 1
17 atoms
S  0.000075 2.704481 0.00012
C  0.000007 0.276114 -0.000005
C  -1.116737 1.140574 0.000025
C  1.11678 1.140526 0.000041
C  -0.000023 -1.127335 -0.000017
C  -2.394546 0.605724 0.000027
C  2.39457 0.605625 0.000065
C  -1.326034 -1.697207 -0.000017
C  1.325964 -1.697261 -0.000005
C  -2.451401 -0.849151 0.000008
C  2.451368 -0.849248 0.000012
H  -3.318915 1.189703 0.000061
H  3.31896 1.189569 0.000119
H  -1.470685 -2.783346 -0.000046
H  1.470573 -2.783405 -0.000023
H  -3.448165 -1.30646 0.000008
H  3.44811 -1.306603 0.000028
