program: Gaussian 09
title: 000138080
version: EM64L-G09RevD.01
frameworkgroup: C1[X(C10H14Si)]
method: RPBEPBE
basis: SDD
operation: Freq
keyword: #p
keyword: freq=noraman
keyword: PBEPBE/SDD
title: #p freq=noraman PBEPBE/SDD
converged: YES YES NO NO
title: Mulliken charges:
elementType: Si C C C C C C C C C C H H H H H H H H H H H H H H
charge: 1.294405 -0.813153 -0.812024 -0.402593 -0.113313 -1.053564 -0.333600 -0.348178 -0.228212 -0.234099 -0.236977 0.230360 0.248333 0.248126 0.230471 0.215941 0.232913 0.246121 0.243294 0.242968 0.235070 0.227629 0.225504 0.225949 0.228628
chargesum: 0.00000
title: Mulliken charges with hydrogens summed into heavy atoms:
elementType: Si C C C C C C C C C C
charge: 1.294405 -0.334460 -0.333427 0.046260 -0.113313 -0.321181 -0.098530 -0.120549 -0.002708 -0.008150 -0.008349
polarizability: 1.70232658e+02 3.66535888e+00 1.30508520e+02 2.75566719e-02 1.20480387e-01 8.20914665e+01
1716.lowfreq: -16.2842 -15.4936 -3.8270 -0.0020 -0.0014 -0.0011 28.0339 72.7548 87.2974
frequency: 26.0688 72.7511 87.2623 135.8730 145.6536 173.4410 209.4021 243.4414 267.8011 318.7912 392.4421 469.3215 514.5197 614.3419 618.2353 635.4822 674.5049 686.2067 706.2886 722.4021 751.4334 801.3017 841.9807 852.6412 860.5030 893.3008 923.0461 924.6103 957.2864 964.8683 980.7394 988.1949 998.5930 1023.3277 1075.8788 1090.8160 1099.3955 1143.5717 1173.4202 1192.9108 1197.0182 1214.3190 1265.3243 1295.0905 1310.3246 1365.3653 1418.7455 1427.5698 1441.6578 1450.7151 1451.7282 1467.9977 1470.8954 1577.2678 1596.4832 2980.8206 2994.4761 3011.1395 3014.8752 3053.7470 3082.1411 3086.1153 3086.5585 3092.0627 3105.6734 3114.4561 3127.8793 3139.8316 3158.4635
redmass: 3.4353 3.1089 3.3495 2.5685 1.0282 2.3621 2.0603 3.9530 4.3081 4.0672 2.7536 3.3766 4.9174 5.5551 2.4657 3.9593 1.2675 5.0285 1.6519 2.4393 1.8372 1.7094 1.5724 1.4222 1.2483 2.5869 1.7469 1.3691 2.0861 1.2873 1.3842 6.2568 1.3133 2.9023 1.7083 1.2239 2.8450 1.4683 1.0558 1.2890 1.1826 1.1552 1.2956 1.2286 1.3951 5.0331 2.1188 1.0882 1.0886 1.0589 1.0523 1.1811 1.7491 5.5000 5.8110 1.0342 1.0575 1.0594 1.0634 1.1042 1.0985 1.1037 1.0981 1.1036 1.0874 1.0858 1.0904 1.0956 1.1014
irintensity: 0.0034 0.3170 0.1913 0.2756 0.0598 0.0987 0.6382 3.9186 2.3585 5.0451 0.0097 9.4591 31.5071 0.0568 0.1041 32.9779 0.0531 3.6987 56.9138 29.8294 38.6141 21.8709 30.1507 45.4529 0.0023 29.2239 82.3297 0.3681 9.7224 0.3498 0.0467 0.4222 0.0001 0.2929 2.0672 0.1710 39.7993 28.1100 0.1261 5.4328 0.0821 0.0154 0.6034 25.3821 19.9265 1.1978 15.1275 17.1285 5.9461 8.5957 6.1340 7.7003 0.9807 0.0037 0.0368 12.6792 61.5685 44.0678 12.6420 25.2586 14.2486 13.1651 13.3482 54.4052 9.3855 3.8737 4.6234 49.0369 33.8775
temp: 298.150 k
press: 1.00000 atm
elementType: 14 6 6 6 6 6 6 6 6 6 6 1 1 1 1 1 1 1 1 1 1 1 1 1 1
symmnumber: 1
zpe: 545800.9 jmol-1
zpe.correction: 0.207885 hartree
zpe.thermalcorrener: 0.219668 hartree
zpe.thermalcorrenthalpy: 0.220612 hartree
zpe.thermalcorrgfe: 0.169303 hartree
zpe.sumelectzpe: -678.025211 hartree
zpe.sumelectthermal: -678.013427 hartree
zpe.sumelectthermalent: -678.012483 hartree
zpe.sumelectthermalfe: -678.063792 hartree
dipole: 0.2754 0.2798 -0.0022
dipole: 0.3926
quadrupole: -69.3875 -68.8575 -78.6980
quadrupole: -1.1425 0.0269 0.0325
quadrupole: 2.9268 3.4569 -6.3837 -1.1425 0.0269 0.0325
hfenergy: -678.2330953 hartree
pointgroup: C01 [X(C10H14Si1)]
dipole: -0.1053642 0.0934188 -0.0634377 debye
dipolederiv: 1.5752416 0.0656383 -0.0637561 0.0895935 1.0619445 -0.0606531 -0.0793739 -0.0601971 1.0246263 -0.3053846 0.0427652 -0.0592267 0.0605239 -0.1840237 0.0186985 0.0632216 -0.0168921 -0.2727789 -0.3082071 0.0709378 -0.0186293 -0.0423237 -0.2649964 -0.0414857 -0.0733426 -0.0096903 -0.1886345 0.0578747 -0.0376761 0.02557 0.0883407 0.1044307 -0.069938 -0.0641706 -0.0664833 0.0592142 -0.2979378 0.0001313 0.0006973 0.0083533 -0.3175612 0.0434857 -0.0064498 0.0438072 -0.2873623 -0.3963069 -0.054564 0.0444344 -0.0428885 -0.3899683 0.1143693 0.0328574 0.1148917 -0.314353 -0.1251654 0.0866091 -0.0630657 -0.0543575 0.0125516 -0.1080349 0.0392026 -0.1116047 -0.0578979 -0.0975983 -0.1130077 0.0815497 -0.0008621 -0.0085419 -0.0929829 0.0004416 -0.0900329 -0.0701696 -0.0269247 -0.0920891 0.064311 -0.0822008 -0.0147386 -0.0846369 0.0572147 -0.0846058 -0.0736465 -0.0658633 0.0589896 -0.0452543 0.0538411 0.0094473 -0.112089 -0.0414334 -0.111998 -0.0593179 0.0790809 0.0183277 -0.0192955 0.0110952 -0.0855541 -0.0559293 -0.0140679 -0.0559986 -0.1205828 0.0677208 -0.0146504 0.078808 -0.0565522 0.0055235 0.1077714 0.1109682 0.0579772 -0.0710134 -0.0305839 -0.1015754 -0.0680213 -0.0639372 -0.0397701 -0.1227737 -0.0673771 -0.1099551 0.0168367 -0.0212684 0.0311884 0.1128425 0.0439172 0.080122 -0.0729825 0.0767383 -0.084146 -0.1128214 0.0622037 -0.0811872 -0.0116179 -0.1271093 -0.1082657 0.0219596 0.018853 0.0693336 0.0479542 -0.121142 -0.0612127 0.0484749 -0.1232167 0.008349 0.0300261 0.0926782 0.0282697 0.0227854 -0.0395751 0.0968151 -0.0664422 0.1544231 -0.0884972 0.0959278 -0.1078353 0.0975126 -0.0145821 -0.1441594 -0.0526812 0.0406689 -0.0664713 0.1063544 -0.0012409 0.0514848 -0.0017752 0.1028949 0.0943576 0.0137224 -0.0892547 0.0202718 0.0885246 0.0189333 -0.0940244 -0.0006505 -0.1092063 0.0970838 0.0871539 0.0134954 0.0944201 -0.0973746 -0.0640264 0.0097793 -0.0432139 0.0746349 0.0844539 -0.0653779 0.0486913 -0.0507747 -0.0142555 0.1022735 0.0382613 0.1025171 0.0488564 0.0170061 0.0968527 -0.0678926 0.0868504 0.0199041 0.07489 -0.0604621 0.0746888 0.072598 -0.0336985 0.085359 -0.0571714 0.1017257 0.0174476 0.0991655 -0.0692139 0.099618 0.0864267 0.0249424 -0.0594018 0.0468115 -0.0801106 -0.0118175 0.125242 0.0618272 0.1246604 0.0643214 -0.1461503 -0.0210671 0.0232726 -0.0225512 0.1107652 0.0340305 0.0242229 0.0339672 0.1312175 unknown
polarizability: 169.9668545|-4.9908836|114.0435002|1.1258141|-23.0726193|98.8222899 unknown
InChI: InChI=1S/C10H14Si/c1-11(8-5-9-11)10-6-3-2-4-7-10/h2-4,6-7H,5,8-9H2,1H3
charge 0 multiplicity 1
25 atoms
Si 1.387171 0.29184 -0.255927
C  2.47533 0.10324 1.337856
C  2.418328 -1.305972 -0.636985
C  3.393637 -0.897834 0.534611
C  -0.511001 0.128182 -0.08465
C  1.828999 1.797981 -1.345985
C  -1.40408 1.033762 -0.721076
C  -1.073169 -0.921613 0.695578
C  -2.805504 0.898125 -0.585531
C  -2.472065 -1.063049 0.835523
C  -3.343412 -0.151617 0.193709
H  1.925501 -0.406877 2.150497
H  2.981885 0.985736 1.763247
H  2.883729 -1.435429 -1.628433
H  1.851261 -2.224428 -0.396533
H  4.27156 -0.36259 0.127333
H  3.771455 -1.748079 1.130529
H  2.926483 1.897432 -1.427973
H  1.42247 1.689169 -2.368402
H  1.435875 2.737764 -0.916227
H  -1.007535 1.855991 -1.329974
H  -0.41463 -1.639589 1.202546
H  -3.474541 1.608145 -1.08564
H  -2.881802 -1.879357 1.441762
H  -4.429045 -0.259132 0.300245
