program: Gaussian 09
title: 000138079
version: EM64L-G09RevD.01
frameworkgroup: C1[X(C14H22O3)]
method: RPBEPBE
basis: SDD
operation: Freq
keyword: #pfreq=noraman
keyword: PBEPBE/SDD
title: #p freq=noraman PBEPBE/SDD
converged: YES YES NO NO
title: Mulliken charges:
elementType: O O O C C C C C C C C C C C C C C H H H H H H H H H H H H H H H H H H H H H H
charge: -0.444374 -0.444238 -0.491821 0.146879 0.146889 0.441073 0.441523 -0.657663 -0.750092 -0.732871 -0.726810 -0.750329 -0.726538 -0.732755 0.063405 0.062023 -0.240818 0.278123 0.220937 0.215319 0.216015 0.210305 0.202357 0.263012 0.201119 0.211311 0.260146 0.221045 0.216007 0.215415 0.211415 0.201198 0.259626 0.202333 0.262916 0.210337 0.369207 0.369578 0.378795
chargesum: 0.00000
title: Mulliken charges with hydrogens summed into heavy atoms:
elementType: O O O C C C C C C C C C C C C C C
charge: -0.075166 -0.074660 -0.113026 0.146879 0.146889 0.441073 0.441523 -0.379540 -0.097820 -0.057197 -0.054234 -0.097862 -0.054298 -0.057169 0.063405 0.062023 -0.240818
polarizability: 2.03911641e+02 1.02952618e-02 1.74769053e+02 -6.46367223e-03 -7.64490973e-01 1.16243875e+02
1716.lowfreq: -0.0003 0.0007 0.0009 1.8453 4.9274 9.1277 54.9366 57.9836 85.8393
frequency: 54.9283 57.9662 85.8359 116.7236 144.1481 174.8140 203.3300 210.6276 219.6584 239.8866 247.3147 253.0970 262.2040 266.1168 277.5980 301.6010 308.3841 309.8710 316.6714 323.6177 327.2116 339.5029 341.6963 367.2959 403.4092 409.3148 424.8138 476.2005 494.2458 498.8503 530.5787 547.2714 560.2055 604.8113 654.0438 683.0985 694.4657 728.8618 744.5828 808.2267 867.9458 906.8032 909.9254 921.0599 923.9848 934.6140 937.1839 949.2242 949.4631 1021.6193 1022.8456 1034.9085 1035.7577 1035.8646 1116.2185 1160.6644 1170.5445 1201.3569 1204.5238 1205.6635 1218.0022 1221.0016 1253.2756 1279.7337 1290.4975 1334.4178 1373.2950 1373.4892 1375.4047 1376.7546 1396.2170 1398.4691 1402.7122 1416.1584 1456.6010 1457.0414 1463.5704 1474.3222 1475.9217 1476.8056 1477.6394 1480.6569 1490.0081 1491.7442 1492.6315 1505.5453 1506.5644 1604.9243 1616.7326 2970.9784 2971.2310 2973.6027 2973.7035 2978.0925 2978.6993 3060.9450 3061.0873 3064.8903 3065.1643 3068.2154 3068.7423 3073.6227 3074.5398 3100.6043 3100.6317 3104.0082 3104.1115 3195.1155 3479.3098 3483.7584 3510.4919
redmass: 2.9685 3.0003 4.4788 3.6438 3.4767 7.2567 1.5666 3.0286 1.0382 1.4933 2.7419 1.8876 1.1435 1.0838 4.2152 2.5702 2.6938 4.5927 2.8188 1.3335 1.0428 1.9893 2.6592 2.3683 2.8428 2.6477 2.8203 5.7211 2.7578 6.0906 1.1344 2.6668 4.3864 1.0524 4.8408 7.7638 7.9789 4.8435 5.2660 3.2621 2.5496 3.6623 1.5983 1.7552 1.5856 1.6750 1.7068 1.2044 1.2042 1.9106 1.3972 1.6921 1.5077 1.6954 1.7807 1.8790 1.5619 2.9067 2.9274 2.8992 2.3947 2.8468 2.5538 2.5351 1.4623 2.8824 1.1845 1.1849 1.2593 1.2080 3.1083 1.6477 1.2638 2.7357 1.0494 1.0478 1.4518 1.0527 1.0488 1.0484 1.0744 1.0743 1.0655 1.0510 1.8798 1.0558 1.0653 6.7972 6.9226 1.0354 1.0354 1.0361 1.0361 1.0369 1.0368 1.1001 1.1001 1.0993 1.0993 1.0997 1.0998 1.0983 1.0981 1.0989 1.0989 1.0982 1.0982 1.0879 1.0643 1.0644 1.0664
irintensity: 0.2461 0.2587 0.4480 3.1644 0.7431 1.6745 7.1316 2.8827 0.0640 15.8716 0.2492 56.3865 0.7960 0.2454 5.5973 4.1156 0.0083 10.7661 0.1305 0.7000 0.0378 1.7193 0.7735 0.5870 2.5480 0.3591 0.2363 1.4450 0.7086 2.4313 211.2705 21.9049 9.8907 29.4791 27.2598 0.1657 22.9711 0.1027 3.6574 1.2127 26.8845 75.4363 5.5629 0.0029 7.9735 0.3320 35.7673 0.0314 0.2962 1.9213 1.6754 25.7572 12.1752 24.6534 26.9725 0.3068 303.8668 86.6613 0.1333 21.9820 35.4042 13.6619 21.7858 58.8470 51.4868 0.5454 2.2014 47.9779 13.4290 35.5984 2.9590 6.1092 34.5013 94.6246 0.4614 0.1832 61.2903 0.2759 0.1135 0.1132 14.7206 9.6109 0.4017 23.1557 29.8618 33.1625 10.1342 0.7714 16.5624 19.4313 27.9309 0.8413 85.2065 65.5379 33.9493 3.1980 10.8394 25.8561 1.9311 0.9210 95.7142 202.4244 12.0060 0.1670 3.3552 0.2589 46.2742 2.6628 11.0310 91.8382 16.3229
temp: 298.150 k
press: 1.00000 atm
elementType: 8 8 8 6 6 6 6 6 6 6 6 6 6 6 6 6 6 1 1 1 1 1 1 1 1 1 1 1 1 1 1 1 1 1 1 1 1 1 1
symmnumber: 1
zpe: 868279.1 jmol-1
zpe.correction: 0.330710 hartree
zpe.thermalcorrener: 0.349795 hartree
zpe.thermalcorrenthalpy: 0.350740 hartree
zpe.thermalcorrgfe: 0.286472 hartree
zpe.sumelectzpe: -771.019919 hartree
zpe.sumelectthermal: -771.000834 hartree
zpe.sumelectthermalent: -770.999890 hartree
zpe.sumelectthermalfe: -771.064157 hartree
dipole: 0.0106 1.6419 -1.0725
dipole: 1.9612
quadrupole: -109.8831 -89.7360 -105.8785
quadrupole: 0.0297 0.0023 -4.8364
quadrupole: -8.0506 12.0966 -4.0460 0.0297 0.0023 -4.8364
hfenergy: -771.3506292 hartree
pointgroup: C01 [X(C14H22O3)]
dipole: -0.0055068 -0.6444082 0.4243602 debye
polarizability: 203.9017472|-0.5131346|174.7715586|-0.2921125|-0.9780613|116.2512632 unknown
InChI: InChI=1S/C14H22O3/c1-13(2,3)8-7-9(14(4,5)6)11(16)12(17)10(8)15/h7,15-17H,1-6H3
charge 0 multiplicity 1
39 atoms
O  2.357662 -1.971741 -0.060892
O  -2.470046 -1.886945 -0.045466
O  -0.080419 -3.277402 -0.004709
C  -2.60163 1.09283 -0.001315
C  2.593303 1.003441 -0.018133
C  -1.282515 0.284825 0.01424
C  1.2471 0.240509 0.005356
C  -0.006382 0.908242 0.02996
C  -2.35025 2.622808 0.039445
C  -3.462792 0.714134 1.242429
C  -3.395462 0.77001 -1.304508
C  2.392756 2.540497 0.027151
C  3.367077 0.656861 -1.327284
C  3.449691 0.594102 1.21914
C  1.193573 -1.178233 -0.014281
C  -1.278767 -1.13503 -0.005616
C  -0.054255 -1.833471 0.038199
H  0.012781 1.998106 0.047689
H  -3.323391 3.146997 0.034602
H  -1.810143 2.929887 0.95454
H  -1.778944 2.972772 -0.840489
H  -2.930638 0.969764 2.177784
H  -4.416702 1.27488 1.224967
H  -3.693369 -0.363453 1.253414
H  -4.34473 1.338708 -1.317285
H  -2.810542 1.055305 -2.198605
H  -3.631798 -0.304393 -1.36825
H  3.382022 3.033597 0.020144
H  1.829547 2.910683 -0.849698
H  1.86591 2.862087 0.944961
H  2.785353 0.961583 -2.21706
H  4.333866 1.194936 -1.346145
H  3.568538 -0.424485 -1.393557
H  4.421184 1.123705 1.196655
H  3.645511 -0.490351 1.22643
H  2.932291 0.864811 2.158543
H  2.074284 -2.908124 -0.245707
H  -2.220201 -2.833325 -0.228433
H  -0.076574 -3.639626 0.919984
