program: Gaussian 09
title: 000138058
version: EM64L-G09RevD.01
frameworkgroup: C1[X(C10H9BrO)]
method: RPBEPBE
basis: SDD
operation: Freq
keyword: #p
keyword: freq=noraman
keyword: PBEPBE/SDD
title: #p freq=noraman PBEPBE/SDD
converged: YES YES NO NO
title: Mulliken charges:
elementType: Br O C C C C C C C C C C H H H H H H H H H
charge: 0.027061 -0.233752 0.493536 -0.365889 -0.378221 -0.258042 -0.186527 -0.192437 -0.216585 -0.296286 0.184082 -0.784822 0.235360 0.246735 0.270116 0.253210 0.255786 0.219550 0.235057 0.256990 0.235076
chargesum: 0.00000
title: Mulliken charges with hydrogens summed into heavy atoms:
elementType: Br O C C C C C C C C C C
charge: 0.027061 -0.233752 0.493536 -0.130529 -0.131485 0.012074 0.066683 0.063349 -0.216585 -0.076736 0.184082 -0.057699
polarizability: 2.77147665e+02 4.29682168e+00 1.15411182e+02 3.32777834e-02 5.10564551e-02 5.20633234e+01
1716.lowfreq: -8.2713 -2.2677 -0.0009 -0.0006 -0.0005 4.2762 36.7758 51.0319 73.1221
frequency: 36.7246 51.0253 73.1143 96.1854 128.3747 169.9230 181.4256 208.8910 296.5101 335.7831 351.5677 407.8981 476.0976 490.8077 555.8267 571.7511 625.2515 649.0151 716.8263 816.6325 825.3363 827.7723 881.8136 908.8864 957.7886 960.2792 972.5607 994.3501 1013.0150 1029.9299 1060.8403 1111.4383 1181.8750 1189.7883 1217.6222 1290.8488 1311.0084 1316.3866 1365.8813 1373.4131 1400.9250 1442.6259 1455.3713 1474.3193 1563.1742 1568.1093 1594.8517 1648.9831 2977.2245 3059.4112 3093.3440 3117.9945 3125.1287 3137.7089 3145.8742 3171.6722 3175.6602
redmass: 3.9622 7.1308 5.4881 1.0580 3.6412 3.5220 11.4785 6.2152 4.5648 3.7129 5.0530 2.8215 3.5454 2.5897 5.3955 2.6359 7.0770 5.7743 3.2906 5.1957 1.4263 1.2858 1.7385 3.2123 1.8831 1.3495 1.3783 4.6205 1.2921 1.6393 2.6692 1.4184 2.2056 1.1621 1.5869 1.4489 1.9696 1.5535 1.3007 3.9287 3.3642 1.0940 1.0503 2.4121 7.2356 6.8260 6.0691 5.7113 1.0377 1.0964 1.0898 1.0911 1.0989 1.0900 1.0884 1.0959 1.0962
irintensity: 0.9529 4.2485 2.0836 0.0614 0.0988 0.8420 0.3923 3.1492 8.1130 0.1470 9.0655 0.0004 1.8013 24.6864 13.5517 3.3846 0.9360 17.5080 0.1423 19.0334 66.8158 3.8968 0.2171 13.8894 52.2515 2.0586 0.1047 55.6221 53.6339 1.5391 58.6899 7.1182 112.5954 21.9372 16.9096 6.4961 84.5188 24.9560 53.9673 84.3647 26.3824 36.3185 20.6646 120.5720 198.0498 163.7865 20.8859 128.5600 3.3545 14.8085 0.5203 9.8325 24.8671 6.3892 4.7899 8.4459 1.7878
temp: 298.150 k
press: 1.00000 atm
elementType: 35 8 6 6 6 6 6 6 6 6 6 6 1 1 1 1 1 1 1 1 1
symmnumber: 1
zpe: 413805.3 jmol-1
zpe.correction: 0.157610 hartree
zpe.thermalcorrener: 0.169533 hartree
zpe.thermalcorrenthalpy: 0.170477 hartree
zpe.thermalcorrgfe: 0.117151 hartree
zpe.sumelectzpe: -474.277874 hartree
zpe.sumelectthermal: -474.265950 hartree
zpe.sumelectthermalent: -474.265006 hartree
zpe.sumelectthermalfe: -474.318333 hartree
dipole: 0.7757 -2.4581 0.0089
dipole: 2.5776
quadrupole: -93.2125 -72.6611 -83.3937
quadrupole: 15.8217 -0.0489 0.0325
quadrupole: -10.1234 10.4280 -0.3046 15.8217 -0.0489 0.0325
hfenergy: -474.4354836 hartree
pointgroup: C01 [X(C10H9Br1O1)]
dipole: 0.2856382 0.9724648 -0.0337139 debye
dipolederiv: -0.9366921 -0.0765465 -0.0075202 -0.1112762 -0.067754 0.0003191 -0.0060642 0.0004129 -0.025179 -1.0048452 -0.0490983 -0.0064518 -0.6161605 -0.7781225 0.010556 0.013479 0.0168865 -0.3186946 -0.3571044 -0.0423438 -0.0029975 -0.1334308 -0.0643793 0.0016606 0.0009942 0.0025115 0.0308273 0.1154399 -0.0603949 0.0042542 0.196401 0.0375469 -0.0027213 -0.0045484 -0.0058589 -0.12515 0.1647588 0.113026 -0.0003222 -0.1656877 0.0667766 -0.0088614 0.0092827 -0.0057445 -0.1491157 0.9924058 0.0111007 0.0118183 -0.172908 0.1315724 -0.0089579 0.0185255 -0.0067211 -0.0648834 -0.5983943 0.0951247 -0.0085657 0.1476839 0.0415209 -0.0024884 -0.010088 -0.003084 -0.0885286 -0.4684952 -0.2097896 0.0025369 -0.2769191 -0.0244129 -0.0050753 0.0045051 -0.0040893 -0.0857168 1.514199 0.1499366 0.0127597 0.1462391 0.0991434 -0.0059025 0.0126185 -0.0056113 -0.128021 -1.6773969 0.0981988 -0.0207024 0.4394858 0.0263892 -0.0036703 -0.0331356 -0.0074262 -0.2267879 2.3094092 -0.201076 0.0343417 0.323354 0.877242 -0.0254264 0.017089 -0.0313554 0.1293887 -0.3339939 0.2372056 -0.0140266 0.4301211 -0.332184 0.0201609 -0.0213957 0.0177672 0.0528463 0.0033608 0.0985648 -0.0045172 0.0628816 -0.0108956 0.005563 -0.0035146 0.0061029 0.1448045 0.0292021 -0.0878494 0.0015152 -0.0552013 -0.035839 0.0055784 0.0004546 0.005228 0.1565189 0.0828682 -0.009866 -0.000371 -0.0331744 -0.0268568 0.0055876 -0.0001371 0.0057857 0.1463022 0.0574894 -0.0565796 0.0007031 -0.0672469 -0.0229462 0.0051721 0.0011713 0.0052732 0.1611086 0.0252667 0.0767416 -0.0039525 0.0797236 0.0135631 0.0056415 -0.003998 0.0056172 0.162997 0.0703272 -0.0484895 0.0005817 -0.058027 -0.0988329 0.0086159 0.0000948 0.0087715 0.16122 0.0632012 -0.0058582 0.0689137 -0.0199352 0.0574278 0.0874984 0.0230581 0.1056138 -0.0345712 -0.1168534 -0.024383 -0.0024899 -0.0975962 0.0685894 0.0006257 0.0000591 0.0016824 0.1228705 0.0658469 -0.0076241 -0.0655073 -0.0183268 0.0424516 -0.0938755 -0.0184503 -0.111762 -0.0222358 unknown
polarizability: 277.2257297|-0.9448437|115.2313397|2.6077004|-2.137894|52.1651009 unknown
InChI: InChI=1S/C10H9BrO/c1-8(12)2-3-9-4-6-10(11)7-5-9/h2-7H,1H3
charge 0 multiplicity 1
21 atoms
Br 5.081379 0.354612 0.015239
O  -3.905831 -1.196167 -0.030904
C  0.324775 -0.24216 -0.016299
C  0.901813 1.061509 -0.051962
C  1.204824 -1.361723 0.029313
C  -1.121849 -0.483674 -0.024686
C  2.297327 1.241636 -0.042797
C  2.605313 -1.19976 0.038899
C  3.137754 0.105683 0.002554
C  -2.129623 0.443701 -0.06939
C  -3.560422 0.024217 -0.072509
C  -4.594996 1.142722 -0.129303
H  0.257702 1.946296 -0.087106
H  0.784026 -2.373592 0.057441
H  -1.447542 -1.534757 0.008227
H  2.727979 2.246462 -0.070379
H  3.266299 -2.070036 0.073838
H  -1.926999 1.521944 -0.105245
H  -4.453959 1.754926 -1.040696
H  -5.610552 0.718942 -0.128429
H  -4.480517 1.821319 0.737794
