program: Gaussian 09
title: 000138054
version: EM64L-G09RevD.01
frameworkgroup: C1[X(C8H10OS)]
method: RPBEPBE
basis: SDD
operation: Freq
keyword: #p
keyword: freq=noraman
keyword: PBEPBE/SDD
title: #p freq=noraman PBEPBE/SDD
converged: YES YES NO NO
title: Mulliken charges:
elementType: S O C C C C C C C C H H H H H H H H H H
charge: 0.170298 -0.425098 0.344512 -0.383030 -0.227751 0.124035 -0.211158 -0.326359 -0.852479 -0.841496 0.256906 0.254214 0.252508 0.252836 0.234285 0.232877 0.263692 0.262528 0.252450 0.366231
chargesum: 0.00000
title: Mulliken charges with hydrogens summed into heavy atoms:
elementType: S O C C C C C C C C
charge: 0.170298 -0.058868 0.344512 -0.126124 -0.227751 0.124035 0.043056 -0.073851 -0.132481 -0.062825
polarizability: 1.51173767e+02 -1.01695013e+00 1.02128883e+02 4.65315204e-01 -4.26225533e-01 6.50936878e+01
1716.lowfreq: -9.7103 -5.0030 -0.0022 -0.0012 0.0017 5.1398 25.3363 85.3635 135.1793
frequency: 24.6263 85.3571 135.1758 148.3297 161.8933 213.6189 218.6938 293.1917 312.9911 341.1207 374.6154 440.5149 442.2759 540.6965 561.4390 629.2143 643.0970 714.9620 742.9986 829.5134 866.6546 896.2637 954.9443 963.1504 977.5400 986.3398 1042.9621 1079.5929 1103.5436 1147.3444 1183.1240 1256.8366 1288.0954 1338.1364 1378.9121 1391.8968 1402.2171 1443.4006 1459.8519 1466.5433 1477.6364 1483.5754 1579.5278 1617.8580 2953.9298 3006.2122 3022.1497 3089.2050 3129.7119 3131.2274 3139.1988 3148.1779 3173.1492 3580.6680
redmass: 3.3605 4.0371 1.0446 1.0725 3.0715 3.3093 4.7618 3.5964 1.2747 4.7642 6.7860 3.5283 3.0072 4.4961 3.4233 6.9124 7.3644 3.6890 5.1514 1.4115 5.6858 1.3436 1.3380 1.1738 1.5566 1.2811 1.5001 2.1091 1.6230 1.3780 2.6250 1.5934 1.8124 1.1337 3.7396 2.7905 1.5103 1.0577 1.0602 1.9188 1.0575 1.4064 6.4517 6.8090 1.0401 1.0278 1.0980 1.0944 1.1061 1.1036 1.0921 1.0889 1.0968 1.0654
irintensity: 2.0353 0.7707 0.0562 0.1396 0.2211 0.1833 1.3477 3.0424 127.8149 6.6709 2.0677 11.1034 11.1773 2.6422 8.9599 6.0193 0.9666 1.7059 12.4890 37.5725 2.1666 12.5132 0.1194 5.1749 8.0401 26.4949 6.4756 10.9783 0.4554 220.2351 57.2306 5.1362 8.0948 0.6035 8.1093 18.6757 9.6711 17.2485 6.9657 65.2877 15.7557 47.9857 24.3022 3.9750 37.1254 33.8212 22.9901 11.1973 17.7708 15.7871 5.7864 2.9785 6.6866 38.7708
temp: 298.150 k
press: 1.00000 atm
elementType: 16 8 6 6 6 6 6 6 6 6 1 1 1 1 1 1 1 1 1 1
symmnumber: 1
zpe: 412794.8 jmol-1
zpe.correction: 0.157225 hartree
zpe.thermalcorrener: 0.168231 hartree
zpe.thermalcorrenthalpy: 0.169175 hartree
zpe.thermalcorrgfe: 0.119762 hartree
zpe.sumelectzpe: -783.382010 hartree
zpe.sumelectthermal: -783.371003 hartree
zpe.sumelectthermalent: -783.370059 hartree
zpe.sumelectthermalfe: -783.419473 hartree
dipole: -1.4648 1.7352 1.6623
dipole: 2.8142
quadrupole: -61.2206 -63.2890 -70.0921
quadrupole: -7.8065 4.7324 0.7838
quadrupole: 3.6466 1.5783 -5.2249 -7.8065 4.7324 0.7838
hfenergy: -783.5392348 hartree
pointgroup: C01 [X(C8H10O1S1)]
dipole: 0.5324218 0.8210265 -0.5180162 debye
dipolederiv: -0.0525784 -0.0129726 -0.0890102 -0.0244805 -0.171154 -0.017295 -0.121867 -0.0193071 0.0393069 -1.4619333 0.1437472 0.1578493 0.1378191 -0.139563 0.0452376 0.2158689 0.0389447 -0.4319057 -0.1991419 0.1164299 0.0309065 0.3515102 0.0825836 -0.0054196 0.0920808 0.0161871 -0.0749063 -0.0553982 0.0003451 -0.0247425 0.0810618 0.016468 0.0381434 -0.0034888 0.0330983 -0.1050049 0.3426624 -0.0495754 -0.0393337 -0.0857564 -0.1057445 0.0129049 0.0551331 0.0098471 -0.2022511 1.3311891 -0.1020442 -0.2064836 -0.1605167 0.0207093 0.0104765 -0.2571691 0.0090231 0.0932764 -0.0659 -0.0160333 -0.0352065 -0.0481328 0.0784056 0.031754 -0.0068861 0.0386227 -0.1089668 -0.2931649 0.0419353 0.009904 -0.1801225 0.0345271 0.0666161 -0.0259635 0.0374465 -0.1474968 -0.0421022 -0.0630691 0.0059471 -0.0509204 -0.033764 -0.0214028 0.00948 -0.0212335 0.0931415 -0.0614053 -0.0092033 0.1334147 0.0139356 0.0543605 -0.0253221 0.1151937 -0.0195304 0.0996601 0.091879 0.0461157 0.0261904 0.0471195 -0.041753 -0.0455902 0.0259553 -0.0443186 0.1251169 0.0423547 -0.0987907 0.0037273 -0.0817904 0.0036166 -0.021764 0.0038218 -0.0199724 0.140137 0.0442351 0.0598138 0.0298737 0.0577775 -0.0249089 -0.0498011 0.0310544 -0.0532653 0.1542476 0.0529315 0.1446275 0.0472601 0.0316509 -0.0373875 -0.0422212 0.0185272 -0.0593715 0.0993847 -0.079557 -0.0454885 -0.122875 0.0126348 0.0460007 0.0494742 -0.1199095 0.0043433 0.0042132 -0.002283 -0.0859765 0.0834301 -0.05286 0.048342 -0.0025897 0.1099763 0.0612909 -0.0770955 0.1097228 0.0583196 0.0069222 0.0211189 -0.0321821 -0.0903378 -0.0333572 -0.0694522 -0.0798471 0.0805816 -0.0873857 0.0127485 -0.0439843 -0.0499053 0.0955755 -0.0314111 0.0854845 -0.0430384 -0.167683 0.0349448 -0.0140413 0.0466847 0.127434 0.009021 -0.0529609 0.012376 0.0750018 0.3855908 -0.0757395 -0.0164811 -0.0727491 0.1239152 -0.0374595 -0.0240785 -0.0402132 0.3470264 unknown
polarizability: 150.9956718|3.0042588|100.6114344|-1.8466893|7.6106077|66.7892314 unknown
InChI: InChI=1S/C8H10OS/c1-6-5-7(10-2)3-4-8(6)9/h3-5,9H,1-2H3
charge 0 multiplicity 1
20 atoms
S  -2.93778 0.128392 0.752636
O  2.967655 -0.547082 -0.470967
C  1.105653 0.946374 0.194459
C  -0.280426 1.058122 0.459175
C  -1.143855 -0.056705 0.354092
C  1.606471 -0.331949 -0.18528
C  -0.619041 -1.317791 -0.016155
C  0.756786 -1.455432 -0.289897
C  2.038691 2.139361 0.309814
C  -3.618593 0.4230 -0.990743
H  -0.694696 2.027764 0.757368
H  -1.282392 -2.186432 -0.07916
H  1.188181 -2.418937 -0.576618
H  1.482618 3.040445 0.615848
H  2.831478 1.978569 1.068666
H  2.534189 2.378414 -0.653283
H  -3.399032 -0.444766 -1.631337
H  -3.176815 1.336501 -1.417146
H  -4.708171 0.544844 -0.881853
H  3.488179 0.287807 -0.366316
