program: Gaussian 09
title: 000138049
version: EM64L-G09RevD.01
frameworkgroup: C1[X(C10H11NO3)]
method: RPBEPBE
basis: SDD
operation: Freq
keyword: #p
keyword: freq=noraman
keyword: PBEPBE/SDD
title: #p freq=noraman PBEPBE/SDD
converged: NO YES NO NO
title: Mulliken charges:
elementType: O O O N C C C C C C C C C C H H H H H H H H H H H
charge: -0.201981 -0.201363 -0.198633 0.028219 -0.491326 -0.361452 0.120214 0.311102 -0.686775 -0.320391 -0.326306 0.384091 -0.372950 -0.362687 0.233410 0.233505 0.221086 0.221711 0.206725 0.227791 0.206795 0.258884 0.290050 0.289141 0.291140
chargesum: 0.00000
title: Mulliken charges with hydrogens summed into heavy atoms:
elementType: O O O N C C C C C C C C C C
charge: -0.201981 -0.201363 -0.198633 0.028219 -0.024411 0.081345 0.120214 0.311102 -0.045465 -0.061507 -0.036256 0.384091 -0.083809 -0.071547
polarizability: 1.99572198e+02 -5.25998817e+00 1.30696903e+02 1.88945354e-02 3.48608553e-02 6.26069001e+01
1716.lowfreq: -22.6976 -9.5904 -4.6850 -0.0008 -0.0005 0.0002 26.2374 46.1943 60.8833
frequency: 24.4627 45.1620 60.8640 75.2958 83.8610 103.1155 188.7194 228.3725 238.1015 244.2267 277.6522 341.8693 406.2572 428.8893 436.4552 489.3134 519.5107 560.1466 622.9279 667.0676 670.8351 725.1642 752.0079 760.0982 803.9639 844.1182 866.4490 892.4556 895.7527 993.1043 996.6536 1008.6284 1015.7565 1053.8328 1084.7587 1091.7510 1110.4563 1118.0655 1181.3076 1203.5605 1217.2733 1220.6724 1285.5032 1292.3556 1299.4721 1353.4307 1366.3887 1388.7432 1403.5286 1411.3362 1431.5021 1469.0106 1474.3499 1478.8351 1482.7859 1578.9276 1600.6934 1614.9808 2955.9001 2973.4468 3001.3577 3007.0606 3048.6686 3078.0405 3078.7111 3161.4707 3162.1126 3185.2224 3187.8294
redmass: 4.3325 1.8527 6.5478 7.0786 4.3781 2.7445 6.0517 1.0948 5.9093 5.6520 5.9836 4.2784 2.8614 5.1559 3.6717 8.9725 5.8879 2.3809 7.1216 4.3665 8.0096 1.6676 1.9781 7.1136 6.9690 1.3786 1.3027 2.0756 1.5397 1.3627 3.5198 2.4482 1.3510 2.6369 1.5757 3.2847 1.3335 2.3385 1.3119 2.6030 1.3497 5.4861 1.0876 1.6262 1.3677 1.7961 6.6825 1.2151 10.8213 3.8619 1.1054 1.0629 2.2773 1.0428 1.0725 8.2630 6.8775 7.7652 1.0599 1.0362 1.0969 1.0611 1.1003 1.1023 1.0987 1.0894 1.0897 1.0952 1.0965
irintensity: 0.0119 0.1820 1.8040 6.3762 0.5214 0.0694 6.5408 0.0313 1.2497 3.5688 3.1004 2.4458 0.0135 0.1907 2.1474 7.3107 3.2844 3.6662 0.3184 22.0320 1.1660 26.7583 2.6206 39.3926 9.8024 21.6519 8.7439 34.7517 28.4543 2.0098 31.1194 1.5406 0.0023 0.1242 0.0162 11.3735 16.2797 3.8104 15.3008 277.8080 0.6646 154.0868 0.7272 61.0491 17.6150 44.0343 71.5819 8.9540 1.4495 77.8882 19.7368 6.4687 1.6439 13.5530 14.0934 64.3110 6.3803 34.5760 30.0761 34.1825 7.2185 16.0831 0.8911 72.7817 47.5722 6.4969 1.1349 0.4710 1.8502
temp: 298.150 k
press: 1.00000 atm
elementType: 8 8 8 7 6 6 6 6 6 6 6 6 6 6 1 1 1 1 1 1 1 1 1 1 1
symmnumber: 1
zpe: 504349.2 jmol-1
zpe.correction: 0.192096 hartree
zpe.thermalcorrener: 0.205609 hartree
zpe.thermalcorrenthalpy: 0.206553 hartree
zpe.thermalcorrgfe: 0.149771 hartree
zpe.sumelectzpe: -666.976642 hartree
zpe.sumelectthermal: -666.963130 hartree
zpe.sumelectthermalent: -666.962186 hartree
zpe.sumelectthermalfe: -667.018968 hartree
dipole: -4.0527 -1.8837 -0.0010
dipole: 4.4691
quadrupole: -104.4974 -83.4170 -81.6679
quadrupole: 10.8522 0.0111 0.0037
quadrupole: -14.6367 6.4438 8.1929 10.8522 0.0111 0.0037
hfenergy: -667.1687389 hartree
pointgroup: C01 [X(C10H11N1O3)]
dipole: -1.5824582 0.7664071 -0.0017445 debye
dipolederiv: -0.8705592 -0.086643 0.0006166 -0.223329 -0.7352811 0.0014618 0.0005116 0.0013093 -0.2847946 -0.6919013 -0.1942073 0.0007475 -0.1929112 -0.7135136 0.0015251 0.0006063 0.0010079 -0.2241527 -0.8028049 0.1820266 -0.0000518 0.1617915 -0.6003202 0.0006253 -0.000316 0.001098 -0.222243 1.8262115 0.0937082 -0.0011001 0.1160856 1.1027143 -0.0022721 -0.0012585 -0.0023185 0.1910381 -0.2754068 0.1375923 -0.0003218 0.3710136 -0.2654398 0.0020428 -0.0025958 0.0023749 0.1545473 0.1184784 -0.006056 0.0000307 0.0344254 0.0715626 0.0002742 -0.0002088 -0.0000782 0.1397482 1.7171176 0.0064999 -0.000894 -0.0838153 0.8400525 -0.0022827 -0.0002003 -0.002235 0.1158795 -0.6111159 -0.0327148 0.0002996 0.0516609 0.0113014 -0.0000065 0.0005321 -0.0002323 -0.0021913 -0.0482452 0.065853 -0.0005316 0.0223792 0.0279997 0.0011968 -0.0000151 0.0012421 0.1049159 -0.0551646 -0.2014811 0.0005274 -0.0929557 -0.033909 -0.0002708 0.0003468 0.0000101 -0.1185266 -0.2123987 0.1924483 -0.0004718 -0.0017635 0.0587329 -0.0004387 -0.0000002 -0.0004943 -0.0915785 -0.6247684 -0.0975038 0.0005443 -0.1239185 0.0964915 -0.0000636 0.0008608 0.0000046 0.0669967 0.0272512 0.1827992 -0.0006327 -0.0593419 -0.0454964 -0.0001229 0.0001435 -0.0002692 -0.105295 0.0839542 -0.1727721 0.0002965 0.1348196 -0.06043 -0.0001563 -0.0003234 0.0000168 -0.1062831 0.0192068 -0.0187142 0.0536698 -0.0715524 0.0298595 0.0797296 0.0845485 0.0861107 -0.0272811 0.0184058 -0.0199757 -0.0539044 -0.0731327 0.0280328 -0.0803133 -0.083729 -0.0869484 -0.0246477 0.0354029 0.0104208 0.014162 -0.0258068 -0.0027032 0.1045548 0.0255918 0.1085562 -0.0634752 0.0369732 0.0102814 -0.0143679 -0.0272083 -0.0069727 -0.1053303 -0.0247315 -0.1089632 -0.0573685 0.0885262 -0.0371496 -0.0623223 0.0201617 -0.0215274 -0.1104853 -0.0197654 -0.1332912 -0.0864518 -0.2225228 -0.0227227 0.0008086 -0.0605126 0.0621568 0.0006314 0.001099 0.0005376 0.1038678 0.0886999 -0.03521 0.0627868 0.0207867 -0.015197 0.108512 0.0189865 0.1314528 -0.0929941 0.0422578 0.0845606 -0.0001568 0.1104255 0.0095239 0.0003018 -0.0002467 0.0002294 0.1374816 0.1235019 -0.05636 0.000187 -0.0149831 0.0304976 0.000331 0.000037 0.0003393 0.1500586 0.1107154 -0.0465898 0.000172 -0.0213829 0.050574 0.0003447 0.0001334 0.0003434 0.171663 0.0781849 0.0619099 -0.0000933 0.0290643 0.0812907 0.0002111 -0.0000067 0.0001975 0.1710867 unknown
polarizability: 199.7223007|4.1597376|130.5462363|-0.0705379|-0.1950395|62.6074638 unknown
InChI: InChI=1S/C10H11NO3/c1-2-3-10(12)8-4-6-9(7-5-8)11(13)14/h4-7H,2-3H2,1H3
charge 0 multiplicity 1
25 atoms
O  -2.415025 -1.82708 0.006531
O  4.138073 1.538641 -0.005137
O  4.490175 -0.715111 0.000246
N  3.717057 0.318163 -0.002672
C  -2.990899 0.544129 0.00067
C  -4.470685 0.115781 0.006299
C  -2.011213 -0.629423 0.003699
C  -0.525262 -0.340681 0.002117
C  -5.422979 1.329722 -0.008112
C  -0.004216 0.981407 -0.001797
C  0.372637 -1.442821 0.004361
C  2.248365 0.088231 -0.001047
C  1.385623 1.2051 -0.003385
C  1.763033 -1.238775 0.002811
H  -2.7807 1.177563 -0.887256
H  -2.776451 1.187104 0.880508
H  -4.663276 -0.512248 0.895648
H  -4.663651 -0.533737 -0.867293
H  -5.266121 1.975063 0.876943
H  -6.478626 1.004402 -0.002522
H  -5.268221 1.951438 -0.910268
H  -0.678679 1.842414 -0.003699
H  -0.050998 -2.451982 0.007264
H  1.810245 2.212115 -0.006371
H  2.471395 -2.071017 0.004461
