program: Gaussian 09
title: 000138048
version: EM64L-G09RevD.01
frameworkgroup: C1[X(C13H12O2)]
method: RPBEPBE
basis: SDD
operation: Freq
keyword: #pfreq=noraman
keyword: PBEPBE/SDD
title: #p freq=noraman PBEPBE/SDD
converged: NO YES NO NO
title: Mulliken charges:
elementType: O O C C C C C C C C C C C C C H H H H H H H H H H H H
charge: -0.264540 -0.438801 0.476538 -0.459323 0.396999 -0.387641 -0.387348 -0.501288 -0.377021 -0.227238 -0.227183 0.340241 -0.230976 -0.184852 -0.422975 0.210901 0.211079 0.234469 0.234528 0.274771 0.250927 0.227982 0.227970 0.230113 0.221216 0.219623 0.351830
chargesum: 0.00000
title: Mulliken charges with hydrogens summed into heavy atoms:
elementType: O O C C C C C C C C C C C C C
charge: -0.264540 -0.086971 0.476538 -0.037344 0.396999 -0.153172 -0.152820 -0.226518 -0.126094 0.000744 0.000787 0.340241 -0.000863 0.036364 -0.203352
polarizability: 2.17745153e+02 1.23040560e+01 1.16848744e+02 2.68089111e-01 -1.39171719e-01 1.04031157e+02
1716.lowfreq: -12.0699 -6.3373 -5.5900 -0.0008 -0.0007 0.0003 8.3661 35.4913 57.1910
frequency: -11.5281 35.3399 57.1836 81.9244 160.6363 226.0418 227.8510 228.0096 329.9953 341.5064 351.0316 402.0365 437.0328 452.4706 507.1145 515.2726 527.5369 603.6337 617.6614 625.1560 677.7393 700.8571 724.3686 752.7949 763.7619 830.9670 838.7566 852.3676 866.3991 879.9906 930.2343 941.2995 969.4433 975.9218 978.5827 982.8064 991.0754 997.4604 1026.9642 1090.3666 1092.5578 1114.4483 1169.3614 1173.1464 1186.9448 1191.4822 1194.3451 1227.8814 1259.8998 1293.2994 1325.6769 1357.0285 1388.0105 1396.7262 1441.4064 1469.4912 1474.2809 1483.1023 1488.4916 1587.2467 1598.0241 1618.4812 1632.9884 2958.2153 3017.5054 3122.1714 3122.5174 3124.9103 3136.7262 3145.7944 3149.4937 3165.3342 3176.4015 3186.4974 3583.7179
redmass: 3.9055 5.1161 5.3562 4.1744 5.5615 4.8994 4.5050 5.3533 5.2202 2.3304 1.1103 2.7914 3.9099 3.0179 4.8566 4.4788 6.8002 4.6079 6.3409 5.5279 1.9132 1.9548 3.5910 1.5128 2.3658 1.4425 3.7094 1.2482 1.5818 4.2003 1.6288 1.3050 4.0339 1.3936 1.5782 5.3262 5.5093 1.3631 2.1728 1.5002 1.6365 1.5710 1.1854 1.0538 1.1264 1.3885 1.0877 2.4440 3.9367 1.3778 1.2709 1.3897 8.5112 6.2727 2.1914 2.2713 2.3539 1.3926 2.2117 6.8510 6.1443 6.2350 6.4378 1.0557 1.1073 1.0874 1.0851 1.0883 1.0921 1.0937 1.0964 1.1017 1.0950 1.0928 1.0660
irintensity: 0.0472 2.0106 0.7989 3.5288 0.2712 0.2516 0.3892 1.2768 7.4489 0.3884 141.9008 0.0137 8.3426 3.7073 4.4404 2.7599 3.1365 2.5734 0.1197 14.2739 31.2882 42.9096 38.2793 64.5161 34.6096 0.0002 13.0248 0.1258 38.6007 2.3832 26.2276 0.1287 181.4350 0.0537 3.2276 69.5064 0.2102 0.4953 4.6612 7.0671 18.3810 315.4289 32.9558 0.0035 4.3300 32.7247 0.9630 5.9331 79.0729 62.1658 0.2900 36.5106 0.4488 60.7943 9.2914 143.9689 8.2127 2.7499 12.7349 73.7116 0.6202 0.1146 218.5301 39.4409 27.4546 9.2358 4.4471 1.7673 16.3656 27.4812 40.5708 21.6378 9.9085 0.0149 37.0743
temp: 298.150 k
press: 1.00000 atm
elementType: 8 8 6 6 6 6 6 6 6 6 6 6 6 6 6 1 1 1 1 1 1 1 1 1 1 1 1
symmnumber: 1
zpe: 559572.4 jmol-1
zpe.correction: 0.213130 hartree
zpe.thermalcorrener: 0.225137 hartree
zpe.thermalcorrenthalpy: 0.226081 hartree
zpe.thermalcorrgfe: 0.173956 hartree
zpe.sumelectzpe: -651.947925 hartree
zpe.sumelectthermal: -651.935919 hartree
zpe.sumelectthermalent: -651.934974 hartree
zpe.sumelectthermalfe: -651.987099 hartree
dipole: 0.1365 2.3477 0.0263
dipole: 2.3518
quadrupole: -63.4139 -88.9917 -85.3709
quadrupole: 5.6278 0.0877 -0.0817
quadrupole: 15.8450 -9.7329 -6.1121 5.6278 0.0877 -0.0817
hfenergy: -652.1610551 hartree
pointgroup: C01 [X(C13H12O2)]
dipole: 0.0469093 0.9240051 -0.013022 debye
polarizability: 217.5587013|13.0471557|117.0199139|-0.0925855|-0.4692395|104.0464393 unknown
InChI: InChI=1S/C13H12O2/c14-12-7-4-8-13(9-12)15-10-11-5-2-1-3-6-11/h1-9,14H,10H2
charge 0 multiplicity 1
27 atoms
O  0.121867 -0.148306 -0.001779
O  4.552235 -1.905337 0.039304
C  -2.231396 0.41161 -0.004346
C  -0.834631 0.9867 -0.017809
C  1.492046 0.164884 -0.004395
C  -2.896802 0.113616 -1.219427
C  -2.88804 0.14832 1.223462
C  2.35467 -0.955794 0.018104
C  2.015687 1.485288 -0.028141
C  -4.195975 -0.440578 -1.20915
C  -4.187194 -0.405825 1.238235
C  3.746578 -0.750797 0.016394
C  -4.844162 -0.700654 0.020816
C  3.417759 1.659468 -0.029092
C  4.296587 0.557548 -0.007148
H  -0.659231 1.592541 -0.93009
H  -0.653312 1.622466 0.872661
H  -2.391456 0.309029 -2.172942
H  -2.375876 0.370786 2.16736
H  1.941671 -1.966982 0.036455
H  1.360382 2.359433 -0.046139
H  -4.701189 -0.668413 -2.154243
H  -4.685587 -0.606542 2.193048
H  -5.852923 -1.128616 0.030504
H  3.830094 2.674469 -0.047474
H  5.382939 0.709393 -0.00814
H  5.510558 -1.659606 0.036372
