program: Gaussian 09
title: 000138036
version: EM64L-G09RevD.01
frameworkgroup: C1[X(C6H14NO2P)]
method: RPBEPBE
basis: SDD
operation: Freq
keyword: #p
keyword: freq=noraman
keyword: PBEPBE/SDD
title: #p freq=noraman PBEPBE/SDD
converged: YES YES NO NO
title: Mulliken charges:
elementType: P O O N C C C C C C H H H H H H H H H H H H H H
charge: 0.973527 -0.505526 -0.512911 -0.521711 -0.295484 -0.298270 -0.302247 -0.305643 -0.642928 -0.660274 0.213888 0.212724 0.239823 0.212308 0.225658 0.203212 0.223792 0.216312 0.212772 0.228971 0.213919 0.211773 0.245731 0.210585
chargesum: 0.00000
title: Mulliken charges with hydrogens summed into heavy atoms:
elementType: P O O N C C C C C C
charge: 0.973527 -0.505526 -0.512911 -0.521711 0.131128 0.153860 0.126623 0.134461 0.012734 0.007815
polarizability: 1.30382000e+02 -1.83676376e-01 9.22305405e+01 -1.97272526e+00 2.16698085e+00 8.26865134e+01
1716.lowfreq: -20.5023 0.0018 0.0019 0.0023 6.0334 12.5366 44.8730 66.8942 81.1220
frequency: 44.5595 66.4234 80.9282 101.1967 139.7161 181.6897 200.6404 217.2625 238.9320 251.8277 308.3765 310.9431 411.2033 474.3618 493.5760 524.7068 583.3762 603.9712 630.7374 777.7157 784.4265 847.8577 878.1019 906.5903 918.5138 972.7753 993.8831 1020.0080 1068.8706 1076.5292 1095.0838 1099.0649 1163.1873 1185.2709 1189.7748 1197.5388 1277.8167 1311.5416 1321.9654 1330.7912 1333.5265 1355.8485 1383.2679 1386.4552 1458.7766 1461.5226 1464.1334 1466.7089 1471.9315 1481.7627 1483.9621 1490.5352 2968.6204 2974.3605 2980.7492 2983.7009 2985.6262 2992.2178 3025.7250 3052.5970 3071.3926 3076.2687 3078.9329 3081.6591 3092.5655 3094.7235
redmass: 3.7906 2.6989 2.9619 3.3796 2.2071 1.9112 1.5005 2.0962 1.9216 1.9472 2.5568 2.6838 3.3810 5.3777 5.4496 8.1465 2.8931 8.3963 3.5454 1.1528 1.2244 2.1719 3.3246 2.2805 1.9884 3.3246 4.2672 2.7060 2.3390 1.8792 1.5969 1.6596 1.1200 3.5171 1.2424 1.9393 1.1745 1.2350 1.2072 1.2397 1.2539 1.3081 1.2080 1.2176 1.0815 1.0656 1.0724 1.0574 1.0485 1.0503 1.0629 1.0692 1.0609 1.0665 1.0363 1.0382 1.0615 1.0620 1.1005 1.0980 1.0973 1.0984 1.0989 1.1049 1.1015 1.1012
irintensity: 0.4223 0.1341 0.5636 6.4515 3.8715 2.2318 4.5529 7.0829 1.6469 2.8447 0.4057 2.7692 11.5311 15.0535 39.6443 21.2340 24.6589 72.4897 61.9386 3.8160 45.1197 5.1148 96.5954 29.1233 4.2237 12.9292 124.4687 37.5247 10.7694 9.8577 2.9138 13.4711 4.3014 65.2398 3.6456 18.9442 8.4299 4.8915 6.8667 2.0287 5.6681 19.3526 18.4888 25.7688 6.5032 2.7610 5.0549 6.0339 4.5402 3.4382 18.4032 19.1195 47.8964 55.8924 37.7910 18.7363 78.3607 50.9494 12.4668 1.9604 39.3959 39.3061 39.3553 49.1416 10.7012 60.3138
temp: 298.150 k
press: 1.00000 atm
elementType: 15 8 8 7 6 6 6 6 6 6 1 1 1 1 1 1 1 1 1 1 1 1 1 1
symmnumber: 1
zpe: 526233.1 jmol-1
zpe.correction: 0.200432 hartree
zpe.thermalcorrener: 0.212819 hartree
zpe.thermalcorrenthalpy: 0.213764 hartree
zpe.thermalcorrgfe: 0.161592 hartree
zpe.sumelectzpe: -782.626609 hartree
zpe.sumelectthermal: -782.614221 hartree
zpe.sumelectthermalent: -782.613277 hartree
zpe.sumelectthermalfe: -782.665449 hartree
dipole: 0.6000 1.4572 0.9698
dipole: 1.8504
quadrupole: -57.9077 -69.6595 -74.0835
quadrupole: -1.4707 -4.1471 3.7970
quadrupole: 9.3092 -2.4426 -6.8667 -1.4707 -4.1471 3.7970
hfenergy: -782.8270409 hartree
pointgroup: C01 [X(C6H14N1O2P1)]
dipole: -0.4482829 0.5732277 0.0208029 debye
dipolederiv: 1.9141479 0.1653041 0.069203 0.3109834 0.8695571 0.0782953 0.1267332 0.1618213 0.7673742 -0.8101686 -0.1460205 -0.0903719 -0.4945872 -0.7795468 -0.2350129 -0.1191119 -0.064282 -0.582874 -0.9442007 -0.176709 0.1246625 -0.4824109 -0.6172431 0.0632124 0.0347919 -0.0563357 -0.5622469 -1.199306 -0.1258995 -0.0944139 0.2587719 -0.750288 -0.1231352 -0.0521056 -0.1061143 -0.5470344 0.5569857 0.2368147 0.0867871 0.4667665 0.3451054 0.0790435 0.0507327 0.0641812 0.2981481 0.0722711 -0.0931496 -0.003929 -0.3242202 0.4213835 0.1055768 0.0051716 0.0976346 0.3706954 0.3363908 0.012109 0.0538958 0.1662108 0.5010734 0.1167498 -0.1715821 -0.1180719 0.0775394 0.6788436 0.1169675 -0.0768959 0.0754418 0.2887508 -0.0058391 0.250176 0.1138538 0.1224937 -0.0738049 -0.0710213 -0.1039342 -0.0754614 0.0480598 -0.0258943 -0.0950664 -0.0280896 -0.0866225 0.0405711 0.0397453 0.0163539 0.0751615 0.0175102 -0.0451763 0.0206989 -0.0835897 -0.1372736 0.0394178 0.1158821 -0.0584099 0.0404027 -0.0875406 0.0322988 -0.0490615 0.0104862 0.0533781 -0.1391767 -0.058794 0.0826532 -0.0137948 0.0740167 -0.0651626 0.1114711 -0.019494 -0.1178169 0.029324 -0.1212589 0.071702 -0.0706216 -0.0192419 0.0029143 0.050454 -0.0007548 0.0262882 -0.1076636 0.0871675 -0.120623 0.101809 0.0572065 -0.0230327 -0.1035676 0.0006383 -0.0518871 -0.1018836 -0.0732987 -0.1234156 -0.0837699 0.0323182 -0.0436672 -0.1126039 -0.0453038 0.0232474 -0.0462138 0.1363673 0.0534 0.0421383 -0.1653281 -0.0509763 0.0378178 0.0132399 0.0323878 0.0127928 -0.0445356 0.0090336 -0.1105042 -0.1083232 0.1011567 0.0116198 0.0801636 0.0606441 -0.2170727 0.0357975 0.0379917 0.1282538 0.005104 -0.0427853 -0.0313233 -0.0303936 0.0469596 0.057474 0.089604 -0.0198843 0.1418704 -0.0981776 0.0617588 -0.0162499 0.0146489 0.0654326 0.0163741 0.053233 0.1315901 0.0325216 0.0880196 -0.0314156 0.0689751 -0.0374578 -0.0605461 -0.0835336 -0.1546183 -0.0226414 -0.1710067 -0.051778 -0.0075742 -0.0176137 0.0120254 0.0730212 -0.0671381 -0.0882279 0.0877126 -0.1374912 0.0256924 0.0702653 0.0515677 0.0290479 0.0434298 -0.0304735 -0.002629 -0.1242161 0.0164003 0.0839983 0.0234765 -0.0848478 0.0038914 0.0112767 0.066043 0.0671702 0.0137497 0.1071362 -0.1803285 -0.0350766 0.032924 -0.0117452 0.0739854 unknown
polarizability: 125.3593501|12.4314147|95.1073058|3.6990992|5.783231|84.8323976 unknown
InChI: InChI=1S/C6H14NO2P/c1-3-7(4-2)10-8-5-6-9-10/h3-6H2,1-2H3
charge 0 multiplicity 1
24 atoms
P  0.745889 -1.163175 0.023921
O  1.57433 -0.340553 1.440064
O  1.464407 0.083923 -1.092376
N  -0.907187 -0.604729 -0.020715
C  -1.982442 -1.628904 0.006768
C  -1.308633 0.817495 0.071645
C  2.198233 0.940425 1.04981
C  2.579241 0.798313 -0.441276
C  -2.801967 -1.691979 -1.30032
C  -1.652085 1.262866 1.512509
H  -1.510494 -2.613864 0.189747
H  -2.653377 -1.436026 0.86857
H  -0.480943 1.423359 -0.33769
H  -2.176471 0.985153 -0.595381
H  3.07922 1.085097 1.697453
H  1.482504 1.773497 1.202011
H  2.676631 1.771333 -0.952134
H  3.51593 0.217475 -0.554874
H  -3.313782 -0.735461 -1.508865
H  -2.144904 -1.923199 -2.156802
H  -3.576456 -2.47822 -1.226947
H  -2.497322 0.682131 1.924488
H  -0.782972 1.116941 2.177512
H  -1.93935 2.331103 1.527583
