program: Gaussian 09
title: 000138007
version: EM64L-G09RevD.01
frameworkgroup: C1[X(C7H11N)]
method: RPBEPBE
basis: SDD
operation: Freq
keyword: #pfreq=noraman
keyword: PBEPBE/SDD
title: #p freq=noraman PBEPBE/SDD
converged: NO YES NO NO
title: Mulliken charges:
elementType: N C C C C C C C H H H H H H H H H H H
charge: -0.266561 -0.218668 -0.264383 -0.427015 -0.452051 -0.435707 -0.199454 -0.191887 0.217832 0.238153 0.228521 0.208887 0.210827 0.219335 0.220524 0.198258 0.253380 0.231059 0.228951
chargesum: 0.00000
title: Mulliken charges with hydrogens summed into heavy atoms:
elementType: N C C C C C C C
charge: -0.013182 -0.000836 -0.026230 0.010393 -0.021889 -0.016926 0.031605 0.037064
polarizability: 7.90651037e+01 1.58530109e+00 7.11463996e+01 1.77873795e+00 -3.29777917e+00 6.79809780e+01
1716.lowfreq: -35.3343 -14.1806 -0.0010 -0.0009 -0.0008 3.1416 148.8077 278.5955 348.9559
frequency: 148.7519 278.5900 348.9531 371.1148 406.3154 569.5111 579.8608 636.2822 675.0353 715.1466 801.1491 809.3580 823.9158 869.2891 940.8444 951.1806 958.9816 968.3498 980.3972 1011.2635 1043.4661 1070.7635 1091.8929 1118.1295 1151.4907 1178.9856 1194.9283 1221.7050 1240.4455 1290.7737 1294.6862 1308.2603 1327.3027 1344.4572 1363.6529 1421.1815 1462.0215 1475.7057 1487.7775 1632.3656 2954.4675 2976.5391 2995.1254 3004.3926 3033.7828 3042.2505 3050.0000 3062.9354 3132.6144 3166.7454 3419.0121
redmass: 1.8881 1.7103 2.1866 2.3406 4.1439 2.4552 4.1293 6.5872 2.0155 1.7572 2.3953 1.5655 2.8319 2.2235 1.4159 1.7884 2.1771 1.8532 2.5703 3.5877 2.5224 2.9293 1.6226 1.0592 1.1495 1.1703 1.3326 1.1391 1.4602 1.2758 1.3280 1.3411 1.4112 1.6190 1.4660 1.3627 1.0844 1.0918 1.0857 6.0000 1.0590 1.0595 1.0641 1.1045 1.1021 1.0871 1.0891 1.1029 1.0868 1.1057 1.0751
irintensity: 4.1721 12.4713 5.7177 8.1574 3.9159 62.8186 2.0654 0.3828 17.8370 90.9142 8.7199 4.2376 10.1100 2.5852 0.4504 0.7908 1.7317 5.9412 1.3676 3.3126 21.2221 5.4995 1.9908 1.0026 10.6816 7.3111 3.8732 0.1404 3.0886 1.6239 0.1155 5.2764 1.6676 0.6189 2.8349 13.7545 1.8822 5.2279 3.0626 1.8324 87.3769 34.8508 50.7591 61.0120 6.3232 89.2422 23.2213 58.8823 11.3304 33.4996 2.7740
temp: 298.150 k
press: 1.00000 atm
elementType: 7 6 6 6 6 6 6 6 1 1 1 1 1 1 1 1 1 1 1
symmnumber: 1
zpe: 439042.3 jmol-1
zpe.correction: 0.167222 hartree
zpe.thermalcorrener: 0.173690 hartree
zpe.thermalcorrenthalpy: 0.174634 hartree
zpe.thermalcorrgfe: 0.137148 hartree
zpe.sumelectzpe: -327.430621 hartree
zpe.sumelectthermal: -327.424153 hartree
zpe.sumelectthermalent: -327.423209 hartree
zpe.sumelectthermalfe: -327.460695 hartree
dipole: -0.0199 -1.4978 -0.7092
dipole: 1.6573
quadrupole: -45.6981 -48.7845 -50.8607
quadrupole: 0.1829 0.8676 -4.3872
quadrupole: 2.7497 -0.3367 -2.4130 0.1829 0.8676 -4.3872
hfenergy: -327.5978431 hartree
pointgroup: C01 [X(C7H11N1)]
dipole: -0.3203614 -0.5655637 0.0516286 debye
dipolederiv: -0.5694467 -0.0286104 -0.0373905 -0.1827078 -0.3959774 -0.2014861 -0.0381092 -0.2306997 -0.3809014 0.1547326 0.0003006 -0.0651606 -0.0157436 0.0126797 0.0434937 -0.0679477 0.0541395 -0.00737 0.3243241 0.0216765 -0.0146163 0.0570085 0.2500737 0.1463546 0.0481833 0.1714922 0.3545322 0.0385103 0.00259 0.0401636 0.0489388 0.0453085 -0.0531117 0.0719928 -0.0099578 0.0929386 -0.0518085 -0.0373239 -0.0069421 -0.0814059 -0.0225587 -0.0582506 -0.0056788 0.0220786 0.1013889 0.299088 -0.1350835 -0.0812643 -0.139214 0.3367259 0.1026834 -0.0760091 0.0280767 0.1900863 -0.0311574 -0.0304051 -0.0643373 -0.0779709 -0.1163344 -0.1855596 -0.0407447 -0.2084893 0.0130807 -0.0595521 -0.0960673 -0.0115295 -0.0086963 -0.1199706 -0.1872816 -0.04339 -0.1699587 -0.0467183 -0.1760882 0.0622553 0.0642465 0.0655257 0.034209 -0.0235946 0.0503851 -0.017092 0.0404172 -0.1841724 0.0333942 0.067257 0.0222866 0.0411607 -0.0234206 0.0567453 -0.0229859 0.0115839 -0.066059 -0.0655594 -0.0796087 -0.0385984 0.0286656 -0.0560825 -0.1258412 -0.0813419 -0.0359825 0.0332952 -0.0200176 0.0347254 -0.0573083 -0.0284987 0.1056679 0.0941459 0.1279055 -0.104059 -0.0013298 0.0762577 -0.0424097 0.0963597 -0.0829052 0.0817058 -0.0888559 0.1326176 -0.019162 0.0389154 -0.0028888 -0.0061885 -0.0034575 -0.0008432 -0.1042018 0.0339616 -0.149676 -0.1506624 -0.0085869 0.0312224 0.0361642 0.0754295 -0.2027999 -0.1286918 0.0110479 -0.0563783 0.035926 0.0034826 0.0011363 0.0594533 -0.0398003 0.0024369 0.1480429 0.099793 0.0658718 -0.1639143 0.1975655 0.0854805 0.0612964 0.2000182 0.0814732 0.1432605 -0.0199197 0.0808727 0.0573869 0.0162073 0.1108928 -0.0498204 0.0935767 0.0452758 0.1309121 -0.0301568 0.1250599 0.0360954 0.04208 -0.0092503 0.0959616 -0.0142407 0.0918791 0.1195599 0.0703981 0.138465 -0.0246663 unknown
polarizability: 76.3392838|-4.3879772|69.5922952|-3.7739352|-2.0264962|72.2609022 unknown
InChI: InChI=1S/C7H11N/c1-3-7-4-2-6(1)5-8-7/h1,3,6-8H,2,4-5H2
charge 0 multiplicity 1
19 atoms
N  1.161983 0.33418 1.05678
C  -1.224673 0.262756 0.318765
C  1.213047 -0.223436 -0.344726
C  -1.061479 -1.274492 0.056315
C  0.407241 -1.570553 -0.398527
C  -0.245444 0.650685 1.473984
C  -0.772111 1.010561 -0.92649
C  0.52014 0.760994 -1.271855
H  -2.264321 0.503345 0.601933
H  2.27086 -0.379227 -0.615961
H  -1.785134 -1.594408 -0.714001
H  -1.305771 -1.82493 0.985381
H  0.890065 -2.306332 0.273973
H  0.434126 -1.990972 -1.42101
H  -0.344437 1.731119 1.69505
H  -0.519928 0.090246 2.39212
H  1.606194 -0.327936 1.70989
H  -1.434778 1.694577 -1.467403
H  1.03682 1.210321 -2.125517
