program: Gaussian 09
title: 000137997
version: EM64L-G09RevD.01
frameworkgroup: C1[X(C8H10)]
method: RPBEPBE
basis: SDD
operation: Freq
keyword: #p
keyword: freq=noraman
keyword: PBEPBE/SDD
title: #p freq=noraman PBEPBE/SDD
converged: YES YES NO NO
title: Mulliken charges:
elementType: C C C C C C C C H H H H H H H H H H
charge: 0.329028 0.329029 -0.173939 -0.173936 -0.710365 -0.710365 -0.565079 -0.565079 0.226132 0.226131 0.228867 0.224702 0.228866 0.224702 0.216710 0.223943 0.216710 0.223942
chargesum: 0.00000
title: Mulliken charges with hydrogens summed into heavy atoms:
elementType: C C C C C C C C
charge: 0.329028 0.329029 0.052193 0.052195 -0.256796 -0.256796 -0.124426 -0.124428
polarizability: 1.16570071e+02 -6.46535049e-05 1.01483291e+02 -1.06793828e+01 4.14683596e-05 4.90842360e+01
1716.lowfreq: -9.5656 -9.4547 -7.9645 -0.0009 -0.0008 -0.0007 67.2504 88.1916 101.2543
frequency: 67.2401 88.1727 101.2488 196.5186 265.3325 315.4564 334.4547 373.2228 441.5769 519.6064 572.0772 660.5621 715.6198 740.4995 750.4321 763.8485 879.8381 936.8466 938.2446 945.4127 945.7428 954.7252 993.2316 1000.1277 1071.0684 1075.6916 1155.4438 1260.1075 1295.4870 1298.8757 1401.4446 1425.8327 1434.8256 1435.3576 1607.4330 1613.8811 1633.9933 1639.4243 3089.5735 3091.0044 3100.1145 3101.2813 3103.0813 3105.2692 3202.8204 3203.2303 3208.0013 3210.6247
redmass: 3.4916 2.0686 2.6873 2.1996 2.9762 2.3052 2.6816 2.4809 2.3209 1.9090 2.0465 1.3489 1.2098 2.1471 1.5449 2.4472 1.8088 1.4068 1.3901 1.3465 1.3574 1.5157 1.1403 1.1223 1.5500 1.5737 2.1523 2.6760 1.3769 1.2965 1.1940 1.2987 1.2706 1.2294 4.7050 4.8117 4.3591 4.1731 1.0686 1.0654 1.0746 1.0778 1.0692 1.0682 1.1148 1.1146 1.1146 1.1146
irintensity: 0.0004 0.0051 0.1495 0.0000 2.4549 6.5562 0.0000 3.4999 7.5232 6.6401 4.1757 5.8332 0.0067 0.3510 2.8060 0.2537 4.3769 6.8349 131.4070 91.5518 48.0728 8.8486 31.0080 7.4193 11.2449 9.7841 17.3573 1.6661 0.6834 0.8572 0.8417 14.8167 40.3016 7.2420 7.6457 10.4065 2.2739 0.0680 22.9611 3.4596 0.9871 15.1525 5.5538 0.0016 20.5442 26.3338 17.0638 0.3516
temp: 298.150 k
press: 1.00000 atm
elementType: 6 6 6 6 6 6 6 6 1 1 1 1 1 1 1 1 1 1
symmnumber: 1
zpe: 390364.8 jmol-1
zpe.correction: 0.148682 hartree
zpe.thermalcorrener: 0.157637 hartree
zpe.thermalcorrenthalpy: 0.158581 hartree
zpe.thermalcorrgfe: 0.114905 hartree
zpe.sumelectzpe: -310.167350 hartree
zpe.sumelectthermal: -310.158396 hartree
zpe.sumelectthermalent: -310.157452 hartree
zpe.sumelectthermalfe: -310.201128 hartree
dipole: 0.0000 -0.2403 0.0000
dipole: 0.2403
quadrupole: -44.6054 -45.5582 -51.9575
quadrupole: -0.0001 -1.7757 0.0000
quadrupole: 2.7683 1.8155 -4.5838 -0.0001 -1.7757 0.0000
hfenergy: -310.3160325 hartree
pointgroup: C01 [X(C8H10)]
dipole: 0.0000025 -0.0945217 0.0000111 debye
dipolederiv: 0.3157331 -0.1162002 -0.0043426 -0.1206309 0.09139 -0.0357028 0.0056904 -0.0682992 -0.0152605 0.3157193 0.1162248 -0.0043706 0.1206551 0.0914265 0.0356779 0.0056585 0.0682762 -0.0152782 -0.1098819 0.0209758 -0.0842752 -0.1280196 0.1313447 -0.0997395 -0.0698748 -0.1670115 0.0080108 -0.1098874 -0.0210258 -0.0842773 0.1279794 0.1314191 0.0997089 -0.0699145 0.1669794 0.007942 -0.1315331 -0.0403576 0.0939775 -0.0165637 -0.2182164 -0.1045211 0.0728088 -0.0776112 -0.338391 -0.1315387 0.040385 0.0939599 0.016583 -0.2181752 0.1044989 0.0727973 0.0775896 -0.3384318 -0.1916207 0.0091467 -0.1359414 -0.0060692 -0.1324551 -0.2029602 -0.1034713 -0.2045247 -0.1545539 -0.1916122 -0.0091944 -0.1359559 0.0060288 -0.1323617 0.2029456 -0.1034899 0.2045119 -0.1546597 0.0563034 -0.0417596 0.0914357 -0.0177203 0.0121594 0.093275 0.0847157 0.1067255 0.0362311 0.0562939 0.0417897 0.0914319 0.0177475 0.0121176 -0.0932614 0.0847201 -0.1067111 0.0362837 0.0454414 0.0911362 -0.04158 0.0652556 -0.0052937 0.0771065 -0.044329 0.0838468 0.1446485 -0.117037 -0.0193116 -0.0118222 0.0051935 0.0987853 0.0346754 -0.03781 0.0336033 0.1681351 0.0454539 -0.0911416 -0.0415544 -0.065261 -0.0053404 -0.0770767 -0.0443067 -0.0838157 0.1446829 -0.1170386 0.0192928 -0.0118231 -0.0052179 0.0987724 -0.0346611 -0.0378059 -0.0335922 0.1681504 0.0530395 0.1010026 0.0106657 0.1113571 -0.0256301 0.0877461 -0.0050562 0.1001332 0.1134948 0.0795612 -0.0001214 0.0818835 -0.0386711 0.0478983 0.1228631 0.0973459 0.0993737 0.0376983 0.0530539 -0.1009889 0.0106943 -0.1113483 -0.0256901 -0.0877163 -0.0050256 -0.1001041 0.1135395 0.07955 0.0001476 0.0818943 0.0387022 0.0478493 -0.1228583 0.0973473 -0.0993699 0.0377579 unknown
polarizability: 115.2474039|-0.0010287|101.48329|-14.1972207|-0.005777|50.406904 unknown
InChI: InChI=1S/C8H10/c1-5-7(3)8(4)6-2/h5-6H,1-4H2
charge 0 multiplicity 1
18 atoms
C  0.751167 0.485146 -0.027893
C  -0.751235 0.485093 0.027535
C  1.432323 -0.779284 0.367053
C  -1.432287 -0.779478 -0.367136
C  1.451969 1.595846 -0.415289
C  -1.452123 1.595824 0.414687
C  2.631355 -1.21817 -0.10597
C  -2.631307 -1.218339 0.105942
H  0.89443 -1.402428 1.096835
H  -0.894322 -1.402758 -1.096749
H  0.941453 2.49484 -0.776782
H  2.546236 1.623098 -0.374633
H  -0.941674 2.494935 0.775983
H  -2.546391 1.622985 0.374027
H  3.08143 -2.147583 0.259188
H  3.183161 -0.668614 -0.878088
H  -3.081298 -2.147871 -0.259016
H  -3.183188 -0.668643 0.877906
