program: Gaussian 09
title: 000137995
version: EM64L-G09RevD.01
frameworkgroup: C1[X(C6H12)]
method: RPBEPBE
basis: SDD
operation: Freq
keyword: #p
keyword: freq=noraman
keyword: PBEPBE/SDD
title: #p freq=noraman PBEPBE/SDD
converged: YES YES NO NO
title: Mulliken charges:
elementType: C C C C C C H H H H H H H H H H H H
charge: -0.110544 -0.516846 -0.517180 -0.033260 -0.710357 -0.710275 0.233921 0.233138 0.220674 0.220795 0.233144 0.184991 0.203513 0.208850 0.223563 0.203614 0.208838 0.223421
chargesum: 0.00000
title: Mulliken charges with hydrogens summed into heavy atoms:
elementType: C C C C C C
charge: 0.123377 -0.063034 -0.063240 0.151730 -0.074432 -0.074402
polarizability: 7.05337496e+01 7.34952821e-03 6.39078449e+01 -9.04838460e-01 8.15639480e-03 5.47173254e+01
1716.lowfreq: -19.9109 -11.0911 -0.0004 0.0005 0.0005 17.4552 88.1971 191.1511 201.3405
frequency: 88.1959 191.1312 201.2997 219.4821 280.7254 324.0389 449.2345 451.0116 729.8551 791.1714 813.6671 871.1215 897.1569 916.2234 948.2291 958.0807 993.3122 1031.8004 1057.9344 1100.1439 1133.2520 1162.7677 1163.4496 1197.7363 1215.8613 1281.8171 1305.3239 1375.1603 1379.4218 1396.3082 1440.2824 1463.8765 1468.0766 1468.9397 1478.5923 1487.1932 2955.0888 2967.7339 2970.7516 3058.8876 3065.5484 3070.9849 3074.8332 3084.2241 3084.4603 3096.2090 3181.3593 3200.5338
redmass: 2.4890 1.8345 1.1605 1.1332 2.0810 2.1341 2.4512 2.5330 1.6653 1.1551 1.3082 3.0140 2.3017 1.2919 2.1852 1.5865 1.1849 1.2634 1.2819 1.1448 2.3008 1.4271 1.9429 2.2477 1.5960 1.3321 1.3944 1.2125 1.6807 1.2853 1.0870 1.0440 1.3004 1.0525 1.0491 1.0844 1.0836 1.0352 1.0357 1.0993 1.0983 1.1001 1.0993 1.0808 1.0527 1.0698 1.1165 1.1145
irintensity: 0.0516 0.0600 0.0476 0.0062 0.1823 0.0727 0.7767 0.6646 2.1882 0.7735 14.9214 14.4747 2.2756 5.2334 4.9747 0.5573 10.6373 28.5946 8.5414 0.1010 2.8004 0.5646 8.6407 2.5003 3.5836 4.0102 0.9060 19.9782 10.5452 4.8048 8.4848 1.5834 4.2861 3.9958 16.5395 11.9620 21.7234 37.7509 30.5014 4.8309 71.5623 20.1477 60.6613 43.8488 32.3493 6.0774 0.1912 40.8734
temp: 298.150 k
press: 1.00000 atm
elementType: 6 6 6 6 6 6 1 1 1 1 1 1 1 1 1 1 1 1
symmnumber: 1
zpe: 427919.1 jmol-1
zpe.correction: 0.162986 hartree
zpe.thermalcorrener: 0.170413 hartree
zpe.thermalcorrenthalpy: 0.171357 hartree
zpe.thermalcorrgfe: 0.132125 hartree
zpe.sumelectzpe: -235.299173 hartree
zpe.sumelectthermal: -235.291746 hartree
zpe.sumelectthermalent: -235.290802 hartree
zpe.sumelectthermalfe: -235.330034 hartree
dipole: -0.0900 0.0004 0.0102
dipole: 0.0906
quadrupole: -40.4292 -40.3509 -37.9003
quadrupole: 0.0008 1.0300 0.0011
quadrupole: -0.8691 -0.7908 1.6598 0.0008 1.0300 0.0011
hfenergy: -235.462159 hartree
pointgroup: C01 [X(C6H12)]
dipole: 0.0352854 -0.0026817 0.004267 debye
dipolederiv: -0.1027098 0.0137582 -0.0624795 0.0106639 0.1127128 0.003927 -0.1135517 0.0076809 0.0930129 -0.0756325 -0.1169692 -0.0597116 -0.127367 -0.1400069 -0.0257637 -0.0301053 -0.0232179 0.0881682 -0.0417514 0.0958878 -0.0638777 0.1094958 -0.1674378 0.0585994 -0.0365718 0.0518809 0.0803256 0.2120744 -0.0042779 0.0144576 -0.0077589 0.1475648 -0.0023366 -0.0592044 0.0037142 0.1262691 -0.0303768 -0.045794 -0.0137615 -0.047092 -0.0599507 -0.0108783 0.0254386 -0.0040491 0.1039302 -0.0169268 0.0380684 -0.0145067 0.0427813 -0.0700873 0.0288754 0.0222671 0.0162393 0.1009655 -0.0155009 0.0065405 -0.0519044 0.008241 0.1003066 -0.0080086 -0.0189152 -0.0105744 -0.1428702 -0.0263782 -0.0967914 0.0818509 -0.0897719 0.0222938 0.0251246 0.1034991 0.0488929 0.0041401 0.0974764 -0.000294 0.0542196 -0.0348629 -0.0038842 -0.0840849 0.0122749 -0.1107314 -0.0561897 0.101181 -0.0086505 0.0664121 0.0219694 0.0102065 0.0681416 0.0258529 0.1010335 -0.0737203 0.0045906 0.1061775 0.0670777 0.1011097 -0.0167819 -0.036024 0.085592 -0.0630582 0.0124074 0.0050488 -0.0031586 -0.0885742 -0.0014784 0.0182527 -0.0027148 -0.0519383 -0.0056751 -0.184698 0.0730691 -0.0218854 -0.0290685 -0.0051828 0.0738353 0.0239921 -0.0814854 -0.0382212 -0.1681763 -0.1677671 -0.0264367 0.1065487 0.0034122 0.0775676 -0.0295291 0.1298374 -0.0027461 0.0181828 0.0491063 0.1173517 -0.041168 0.0769484 -0.1343813 0.0474195 -0.032242 0.0578362 0.0706277 0.0774723 0.0182324 -0.0342641 -0.0023497 0.0703519 -0.0410107 -0.0748437 0.0282564 -0.1690211 -0.1584121 0.0725989 0.1039022 0.0444313 0.0678116 0.0082193 0.1254331 -0.0217843 0.0189016 0.0154367 -0.1443577 -0.0351526 -0.1031895 -0.1083735 -0.0239482 -0.0313373 -0.0354766 0.0777446 unknown
polarizability: 70.488606|-0.4527953|63.9164314|0.9851715|-0.5259642|54.7538825 unknown
InChI: InChI=1S/C6H12/c1-5(2)6-3-4-6/h5-6H,3-4H2,1-2H3
charge 0 multiplicity 1
18 atoms
C  -0.540465 0.045208 0.442689
C  -1.799019 -0.657228 -0.086207
C  -1.681033 0.877261 -0.16162
C  0.79421 -0.094012 -0.293262
C  1.701108 1.131375 -0.023965
C  1.503423 -1.412343 0.098214
H  -0.440177 0.091446 1.536157
H  -2.505368 -1.086861 0.630472
H  -1.71142 -1.220169 -1.021867
H  -1.515303 1.327232 -1.14656
H  -2.307384 1.476597 0.505799
H  0.57579 -0.129096 -1.382679
H  1.954847 1.197762 1.051786
H  2.649296 1.062259 -0.589487
H  1.193685 2.070631 -0.310431
H  1.743825 -1.41865 1.179023
H  2.451094 -1.539123 -0.457861
H  0.859391 -2.28659 -0.108902
