program: Gaussian 09
title: 000137986
version: EM64L-G09RevD.01
frameworkgroup: C1[X(C9H10O2)]
method: RPBEPBE
basis: SDD
operation: Freq
keyword: #pfreq=noraman
keyword: PBEPBE/SDD
title: #p freq=noraman PBEPBE/SDD
converged: YES YES NO NO
title: Mulliken charges:
elementType: O O C C C C C C C C C H H H H H H H H H H
charge: -0.281597 -0.246269 -0.372280 -0.297200 -0.494118 0.364463 -0.319840 -0.207705 -0.210329 0.076178 -0.498806 0.275449 0.248277 0.244671 0.241542 0.272670 0.248860 0.244304 0.229535 0.241148 0.241046
chargesum: 0.00000
title: Mulliken charges with hydrogens summed into heavy atoms:
elementType: O O C C C C C C C C C
charge: -0.281597 -0.246269 -0.096831 -0.048923 -0.007904 0.364463 -0.047170 0.041155 0.033974 0.076178 0.212923
polarizability: 1.24726631e+02 9.12826865e+00 9.24349950e+01 -2.28353669e+00 -1.01783359e+00 7.02109892e+01
1716.lowfreq: -23.2947 -13.8544 -3.8926 -0.0004 0.0007 0.0010 49.3966 75.7974 100.6928
frequency: 49.2637 75.6848 100.6317 132.5516 187.5751 287.9377 342.3933 407.6438 450.6409 479.0759 513.3781 556.5802 689.6711 702.2063 735.0014 741.5347 785.7620 840.6125 850.7876 876.3244 893.3530 902.6333 919.2551 928.4628 950.3593 957.4989 1015.0067 1036.0353 1083.6857 1102.2615 1112.1108 1139.8273 1146.1470 1191.6174 1211.7209 1223.5361 1229.2884 1249.6893 1267.9860 1298.2255 1421.2397 1449.3104 1463.2203 1470.8166 1564.9141 1598.8802 1627.4964 3000.7199 3017.5211 3097.9390 3100.3915 3104.5708 3130.5480 3144.2384 3174.3000 3194.3738 3207.7739
redmass: 3.0958 1.2346 3.7576 3.9865 4.2426 4.2541 5.1154 3.6040 3.1884 3.0100 2.2275 3.5455 2.2688 5.2721 3.2230 3.8760 4.9430 3.4222 2.0993 2.4372 1.7957 3.5565 1.9623 1.9858 3.7508 1.9993 1.5978 2.0956 1.5264 1.0709 1.2667 1.8615 1.4506 1.6387 1.5263 1.9442 1.5498 1.3724 2.2616 1.6504 1.1850 1.0502 1.0518 1.1026 5.7143 7.8422 9.6417 1.0296 1.0588 1.1076 1.1041 1.0904 1.0915 1.1045 1.0873 1.0986 1.1111
irintensity: 2.1499 0.9761 0.2995 1.3160 5.4365 15.0659 1.0464 6.3536 5.3994 3.4258 2.5447 0.9670 45.9395 6.8764 55.6526 10.3903 13.9361 3.5350 11.2013 7.0293 12.4074 6.4589 5.8795 3.2143 12.4728 2.7166 40.6683 59.6864 38.9401 3.3449 0.0470 61.6655 27.8486 26.4675 13.6316 123.7852 9.6516 2.1284 86.5687 12.1657 19.0740 13.1179 11.5523 6.3479 19.5708 56.2172 229.9166 40.0015 46.3407 35.8622 28.9347 39.8313 9.2849 17.8688 4.1052 2.3545 14.1709
temp: 298.150 k
press: 1.00000 atm
elementType: 8 8 6 6 6 6 6 6 6 6 6 1 1 1 1 1 1 1 1 1 1
symmnumber: 1
zpe: 439222.2 jmol-1
zpe.correction: 0.167291 hartree
zpe.thermalcorrener: 0.177054 hartree
zpe.thermalcorrenthalpy: 0.177999 hartree
zpe.thermalcorrgfe: 0.131413 hartree
zpe.sumelectzpe: -498.525920 hartree
zpe.sumelectthermal: -498.516156 hartree
zpe.sumelectthermalent: -498.515212 hartree
zpe.sumelectthermalfe: -498.561798 hartree
dipole: 1.1225 -1.5971 0.3502
dipole: 1.9833
quadrupole: -56.0630 -65.9064 -63.1685
quadrupole: 8.6981 -1.1946 1.2184
quadrupole: 5.6496 -4.1938 -1.4559 8.6981 -1.1946 1.2184
hfenergy: -498.6932109 hartree
pointgroup: C01 [X(C9H10O2)]
dipole: 0.4583686 -0.6144543 0.1455903 debye
dipolederiv: -1.0793513 -0.3793347 0.0037942 -0.6513554 -0.9312709 0.0638562 0.026611 0.0770201 -0.3048109 -0.9036568 0.2666764 -0.0831469 0.2042386 -0.8165614 0.0967455 -0.1055215 0.1234736 -0.3441851 -0.0154084 0.1042715 -0.022448 0.0717479 0.0445606 -0.0725436 -0.0242066 -0.0688306 0.0047935 0.1014399 0.168584 0.0508778 0.2362907 0.0423927 0.0174642 0.1111687 0.0174746 -0.0576416 -0.0068005 -0.1825255 0.0034658 -0.1777259 0.0187586 0.0265743 0.0203224 0.026334 0.1846165 -0.814672 -0.0824722 0.0106955 -0.4877345 0.0729817 -0.0372533 0.0692168 0.0147219 -0.1121812 0.3871794 -0.1226923 0.0258707 0.1049477 -0.0345821 -0.0713978 -0.1022308 -0.1206535 -0.163596 -0.0470447 0.021273 -0.1776833 0.1120386 -0.159819 0.0685905 -0.1023438 0.1721291 -0.005059 -0.2963032 0.0576734 -0.0848447 -0.0079898 0.0315274 0.1665358 -0.2147425 0.0687009 0.0065967 1.8432492 0.1254326 0.0866747 0.4443356 1.3345709 -0.164135 0.0913874 -0.1946739 0.274106 0.6583463 0.1773515 0.0010764 0.1287692 0.2790521 0.012029 0.0294723 0.0218613 0.2753777 0.0394501 -0.0764761 0.042563 -0.0611471 -0.0254334 0.0468753 0.0422721 0.046734 0.0487442 -0.073167 -0.1154145 -0.0223942 -0.1067489 -0.0374674 -0.0228086 -0.0436224 -0.0311065 0.0654568 -0.0742483 0.111752 -0.0792335 0.1531082 -0.0046949 0.0671161 -0.0495933 0.0246222 0.0530156 0.0586276 0.042938 0.09133 0.0193251 0.0426717 -0.1110399 0.0595308 -0.070181 -0.1293761 0.068473 0.0637149 -0.0145016 0.0555939 0.0012912 0.0488158 -0.0129874 0.067417 0.1649027 0.1397662 -0.0455148 0.0219334 -0.0308318 0.0246946 -0.1154529 0.0536856 -0.134896 0.0362714 0.0661531 -0.0271963 0.1231829 -0.0163271 0.1025644 -0.018412 0.1600662 -0.0234573 0.0011222 0.0414567 -0.0409631 -0.0001542 -0.1079351 -0.1050166 0.0303694 0.0109474 0.0356172 0.1116745 -0.031668 -0.0458637 -0.0173012 0.0337149 0.0869 0.0716406 -0.0824138 0.0255546 -0.0954571 -0.0618213 -0.0212141 0.0402432 0.0836853 0.0328796 -0.1035695 0.0629814 -0.0778619 -0.0143707 unknown
polarizability: 124.1937716|10.1261255|93.0303475|-1.3095718|-0.9051798|70.1484965 unknown
InChI: InChI=1S/C9H10O2/c1-11-9(10)8-5-6-2-3-7(8)4-6/h2-3,5-7H,4H2,1H3
charge 0 multiplicity 1
21 atoms
O  -2.149016 -0.853841 0.131284
O  -2.216771 1.441918 -0.305715
C  0.736254 -0.944763 0.47996
C  2.208187 0.774234 0.220767
C  1.85623 -0.264816 1.354872
C  -0.095168 0.327195 0.153607
C  0.793315 1.355879 -0.002525
C  1.589005 -1.260317 -0.780989
C  2.46779 -0.23349 -0.939685
C  -1.549426 0.410128 -0.033836
C  -3.617966 -0.878756 -0.046484
H  0.169732 -1.780151 0.908309
H  3.005075 1.505231 0.414176
H  2.695281 -0.941949 1.588342
H  1.465228 0.207328 2.27344
H  0.560858 2.384771 -0.285041
H  1.440135 -2.13171 -1.421781
H  3.192897 -0.07333 -1.740096
H  -3.90379 -1.928031 0.113454
H  -3.887416 -0.543046 -1.062371
H  -4.105333 -0.216283 0.689012
