program: Gaussian 09
title: 000137953
version: EM64L-G09RevD.01
frameworkgroup: C1[X(C8H6O)]
method: RPBEPBE
basis: SDD
operation: Freq
keyword: #p
keyword: freq=noraman
keyword: PBEPBE/SDD
title: #p freq=noraman PBEPBE/SDD
converged: NO NO NO NO
title: Mulliken charges:
elementType: O C C C C C C C C H H H H H H
charge: -0.159042 0.280408 -0.620905 0.101946 0.044655 -0.384985 -0.336921 -0.198001 -0.212151 0.250908 0.250920 0.252962 0.265346 0.231100 0.233760
chargesum: 0.00000
title: Mulliken charges with hydrogens summed into heavy atoms:
elementType: O C C C C C C C C
charge: -0.159042 0.280408 -0.119077 0.101946 0.044655 -0.132023 -0.071575 0.033100 0.021609
polarizability: 1.20500530e+02 8.01291959e-02 9.11778254e+01 -5.68216244e-03 1.37261231e-03 3.82113958e+01
1716.lowfreq: -0.0008 -0.0002 -0.0001 8.6706 18.5321 22.4511 119.2522 209.2301 261.0307
frequency: 119.2500 209.2292 261.0304 383.8872 446.9264 490.6806 537.6593 560.8141 615.6489 707.0854 728.5697 773.6217 804.7336 883.8067 927.0621 955.8165 972.5413 998.7416 999.8770 1070.0167 1076.0888 1144.0723 1150.3891 1174.0243 1194.5779 1273.8779 1396.0265 1426.1584 1436.9476 1450.0250 1598.0512 1607.1406 1715.1370 3013.1573 3080.1428 3128.2355 3144.2733 3157.3376 3168.2164
redmass: 5.6459 2.7731 7.1613 2.8962 3.4489 4.9651 5.1335 2.2966 6.2627 2.7253 6.4027 1.3317 4.8833 1.2754 7.9411 1.4202 2.3072 2.1936 1.3436 1.1846 3.1256 1.8070 1.7916 1.3747 1.6196 1.4839 3.6856 2.0541 1.3884 2.3682 7.3895 7.3960 12.4600 1.0588 1.1048 1.0861 1.0903 1.0961 1.0996
irintensity: 1.6616 7.9920 0.5652 3.3096 9.7970 1.4739 2.1872 4.2791 2.4990 6.3770 2.5792 77.6174 4.3683 0.1429 48.9969 0.7096 6.5667 1.9538 0.4090 0.5917 26.3278 15.8469 1.0846 14.6443 1.8229 15.3158 10.7137 9.2644 3.5691 14.3969 94.7278 9.5649 351.5370 22.9782 11.9877 1.3189 8.7159 20.8085 19.1094
temp: 298.150 k
press: 1.00000 atm
elementType: 8 6 6 6 6 6 6 6 6 1 1 1 1 1 1
symmnumber: 1
zpe: 297755.8 jmol-1
zpe.correction: 0.113409 hartree
zpe.thermalcorrener: 0.120132 hartree
zpe.thermalcorrenthalpy: 0.121077 hartree
zpe.thermalcorrgfe: 0.082260 hartree
zpe.sumelectzpe: -383.016165 hartree
zpe.sumelectthermal: -383.009441 hartree
zpe.sumelectthermalent: -383.008497 hartree
zpe.sumelectthermalfe: -383.047313 hartree
dipole: -3.6798 1.5907 0.0004
dipole: 4.0089
quadrupole: -55.9662 -46.0178 -53.5792
quadrupole: 5.6409 0.0004 -0.0001
quadrupole: -4.1118 5.8366 -1.7248 5.6409 0.0004 -0.0001
hfenergy: -383.1295738 hartree
pointgroup: C01 [X(C8H6O1)]
dipole: 1.4737899 -0.561807 0.0001559 debye
dipolederiv: -1.2393482 0.2848298 -0.000113 0.4046017 -0.5540458 0.0000605 -0.0000515 0.0000171 -0.2972289 0.1599101 0.0869559 0.0000097 0.0638025 -0.0530229 -0.0000071 -0.000034 -0.0000146 -0.0491372 -0.0917086 0.1763416 -0.0000176 -0.03691 -0.3514766 0.0000442 0.0000035 0.0000963 0.1665344 -0.7763928 -0.0561169 -0.0000493 -0.2482548 -0.195042 -0.000011 -0.000031 -0.0000041 -0.0436104 1.8784797 -0.2681532 0.000169 -0.1479705 0.8856239 -0.0000732 0.0001208 -0.0000669 0.1479813 -0.1544937 -0.1608729 0.0000048 -0.1639526 0.0881337 -0.0000229 0.0000178 -0.0000193 -0.1510005 0.1699737 -0.1019528 0.0000193 0.0977696 0.1593476 0.0000021 0.0000025 -0.000013 -0.0815052 0.1022967 0.0009884 0.000016 -0.1324007 0.0537488 -0.0000088 0.0000173 0.0000038 -0.1249905 -0.1265171 0.1210928 0.0000035 0.2591065 -0.0502388 0.0000217 -0.0000007 0.0000137 -0.1696307 0.035601 -0.0531748 -0.0453741 -0.0593599 0.0367976 -0.0804439 -0.0752831 -0.1091609 -0.0211126 0.0356009 -0.0531664 0.0453777 -0.0593471 0.0368321 0.0804215 0.0752895 0.1091288 -0.0211051 0.0691982 0.0441387 -0.0000083 0.0688576 -0.0719056 0.0000131 -0.0000092 0.0000174 0.1647443 0.08942 0.0432686 -0.0000059 0.0192618 -0.0548567 0.0000053 -0.0000095 0.0000138 0.1632882 -0.1173791 0.0420403 -0.0000196 0.0371465 0.0790818 0.0000046 -0.0000228 0.0000004 0.1547776 -0.034641 -0.1062191 -0.0000121 -0.1023506 -0.0089772 -0.0000063 -0.0000097 -0.0000125 0.1619953 unknown
polarizability: 120.4372389|1.3631896|91.2411167|0.0057368|-0.0011224|38.2113958 unknown
InChI: InChI=1S/C8H6O/c9-8-5-6-3-1-2-4-7(6)8/h1-4H,5H2
charge 0 multiplicity 1
15 atoms
O  -2.895605 0.711071 -0.000328
C  0.030654 -0.912443 -0.000073
C  -1.416629 -1.446519 -0.000091
C  -0.346902 0.461404 -0.00013
C  -1.81125 0.099934 -0.000279
C  1.377953 -1.299926 0.000031
C  0.585679 1.516135 -0.000052
C  2.332197 -0.243266 0.000079
C  1.950391 1.127745 0.000033
H  -1.741158 -1.997897 -0.900281
H  -1.741247 -1.997767 0.900145
H  1.699971 -2.346149 0.000096
H  0.287204 2.569103 -0.000094
H  3.40089 -0.489227 0.000164
H  2.734253 1.893401 0.00008
