program: Gaussian 09
title: 000011628
version: EM64L-G09RevD.01
frameworkgroup: C1[X(C8H18FN)]
method: RPBEPBE
basis: SDD
operation: Freq
keyword: #p
keyword: freq=noraman
keyword: PBEPBE/SDD
title: #p freq=noraman PBEPBE/SDD
converged: YES YES NO NO
title: Mulliken charges:
elementType: F N C C C C C C C C H H H H H H H H H H H H H H H H H H
charge: -0.246699 -0.545064 -0.377384 -0.370015 -0.364459 -0.382123 -0.366149 -0.398386 -0.414794 -0.215129 0.192870 0.192863 0.196801 0.196779 0.191555 0.191535 0.194785 0.194841 0.186457 0.186467 0.216626 0.216615 0.206860 0.206908 0.193919 0.193853 0.260242 0.260226
chargesum: 0.00000
title: Mulliken charges with hydrogens summed into heavy atoms:
elementType: F N C C C C C C C C
charge: -0.246699 -0.024595 0.008348 0.023564 0.018631 0.007503 0.006776 0.034856 -0.001026 0.172643
polarizability: 1.23205715e+02 1.71942059e+00 8.34189562e+01 7.76129677e-05 -5.71802849e-05 7.98626854e+01
1716.lowfreq: -3.6551 -0.0008 0.0003 0.0007 10.2672 32.7361 45.4193 49.0107 63.6115
frequency: 33.0208 49.0077 63.1730 77.7201 107.7941 127.2817 128.5943 148.6818 159.7424 210.6753 235.5795 262.5509 359.5795 388.2322 472.0765 495.4950 616.8751 722.2316 731.3681 755.3749 792.6638 846.5754 917.9750 926.6220 978.4220 987.1012 1000.7745 1029.9342 1035.2317 1055.4886 1071.5387 1079.3169 1091.2512 1106.7970 1146.7016 1196.0759 1212.4041 1233.5171 1254.6908 1266.7269 1280.7268 1284.8912 1293.5444 1297.7070 1299.0635 1330.4607 1336.0835 1353.7196 1353.9063 1359.7258 1382.6290 1456.4637 1462.9468 1464.3242 1469.5583 1471.9016 1476.7500 1484.7728 1491.2793 1643.8818 2951.4469 2952.9573 2956.3887 2959.4870 2967.9105 2981.5764 2986.4773 2993.8294 2994.0409 3002.0332 3003.3995 3019.1114 3036.4108 3047.0416 3050.3207 3079.8886 3446.3665 3571.7717
redmass: 4.9777 5.1230 1.6710 3.5204 1.6766 2.7069 4.3085 1.8450 2.1648 5.5854 3.6217 1.0747 3.1393 4.2755 2.7339 3.0776 1.5636 1.0624 1.0831 1.1111 1.1423 1.1985 1.2140 8.3216 5.3691 1.1621 5.0839 3.8835 1.0514 3.8389 2.6158 2.1770 3.4008 4.2379 1.3038 1.6650 1.2423 1.4483 1.2828 1.2984 1.1030 1.0765 1.2970 1.1287 1.0928 1.3467 1.1693 1.5489 1.3821 1.5759 1.3135 1.0755 1.0703 1.0757 1.0855 1.0883 1.0947 1.0985 1.0998 1.0884 1.0588 1.0588 1.0588 1.0593 1.0588 1.0601 1.0968 1.0988 1.0593 1.0559 1.1018 1.1041 1.1049 1.1055 1.1052 1.1102 1.0445 1.0972
irintensity: 1.4725 1.0824 0.0004 0.3274 4.6271 1.8583 3.3540 0.0733 0.1741 0.4244 2.7923 59.9598 16.9969 0.2960 3.1404 17.9901 322.3173 13.5931 0.2397 4.3632 0.5043 0.2770 0.0071 70.0126 3.9673 0.0022 2.1650 17.3369 0.0220 31.5295 7.3112 0.8489 4.5081 8.1840 0.8536 0.0555 16.0913 0.0702 0.6662 0.3657 0.9382 0.6946 1.0000 0.1468 0.0003 0.9977 0.1741 2.5017 3.1625 1.9240 15.9275 0.4528 0.1199 0.5007 0.3364 0.0040 2.0246 3.2993 24.8853 31.9509 1.6015 2.4074 6.2358 7.7872 112.7863 87.0493 0.3346 0.1944 2.1966 91.0094 3.6046 0.0170 27.7081 85.8219 95.5272 100.8580 1.4829 0.0544
temp: 298.150 k
press: 1.00000 atm
elementType: 9 7 6 6 6 6 6 6 6 6 1 1 1 1 1 1 1 1 1 1 1 1 1 1 1 1 1 1
symmnumber: 1
zpe: 660157.2 jmol-1
zpe.correction: 0.251441 hartree
zpe.thermalcorrener: 0.264852 hartree
zpe.thermalcorrenthalpy: 0.265796 hartree
zpe.thermalcorrgfe: 0.210035 hartree
zpe.sumelectzpe: -469.378240 hartree
zpe.sumelectthermal: -469.364829 hartree
zpe.sumelectthermalent: -469.363885 hartree
zpe.sumelectthermalfe: -469.419646 hartree
dipole: 1.4939 2.2060 0.0043
dipole: 2.6642
quadrupole: -97.7338 -62.8232 -60.1577
quadrupole: 1.6186 -0.0255 0.0005
quadrupole: -24.1622 10.7483 13.4138 1.6186 -0.0255 0.0005
hfenergy: -469.6296804 hartree
pointgroup: C01 [X(C8H18F1N1)]
dipole: -0.5803807 -0.8727298 0.0136418 debye
polarizability: 123.173613|2.0539246|83.4501965|-0.1215163|-0.0484055|79.8635474 unknown
InChI: InChI=1S/C8H18FN/c9-7-5-3-1-2-4-6-8-10/h1-8,10H2
charge 0 multiplicity 1
28 atoms
F  5.711436 0.368048 -0.022972
N  -5.75856 -0.264197 0.012121
C  -0.609309 -0.43495 0.002767
C  0.688932 0.402838 -0.009183
C  -1.890687 0.429022 -0.004067
C  1.970052 -0.461374 -0.001222
C  -3.192862 -0.403947 0.007337
C  3.264055 0.388342 -0.015036
C  -4.476335 0.470592 0.000529
C  4.514957 -0.485504 -0.007002
H  -0.61883 -1.110784 -0.87785
H  -0.615046 -1.091275 0.898048
H  0.69801 1.078917 0.870791
H  0.695074 1.058262 -0.90469
H  -1.883825 1.086583 -0.898762
H  -1.880572 1.10547 0.876386
H  1.958714 -1.137963 -0.881212
H  1.962804 -1.115601 0.895561
H  -3.208015 -1.059349 0.903707
H  -3.211412 -1.078314 -0.874803
H  3.280352 1.034652 -0.913522
H  3.284632 1.057358 0.866567
H  -4.461974 1.145772 0.878612
H  -4.466282 1.125726 -0.892675
H  4.582741 -1.103988 0.907891
H  4.576582 -1.129191 -0.904783
H  -5.914635 -0.810699 0.865776
H  -5.918396 -0.830947 -0.827515
