program: Gaussian 09
title: 000137935
version: EM64L-G09RevD.01
frameworkgroup: C1[X(C6H8N2)]
method: RPBEPBE
basis: SDD
operation: Freq
keyword: #p
keyword: freq=noraman
keyword: PBEPBE/SDD
title: #p freq=noraman PBEPBE/SDD
converged: NO NO NO NO
title: Mulliken charges:
elementType: N N C C C C C C H H H H H H H H
charge: -0.689281 -0.004864 0.360581 0.279266 -0.326377 -0.821896 -0.455389 -0.352887 0.224941 0.228351 0.239810 0.228431 0.223695 0.235218 0.306698 0.323702
chargesum: 0.00000
title: Mulliken charges with hydrogens summed into heavy atoms:
elementType: N N C C C C C C
charge: -0.058880 -0.004864 0.360581 0.279266 -0.101436 -0.125304 -0.231694 -0.117668
polarizability: 9.75908511e+01 -5.64762289e+00 9.02675220e+01 2.43456196e-03 -2.63225339e-03 3.83548512e+01
1716.lowfreq: -0.0008 -0.0008 0.0004 2.2674 10.1923 14.2301 160.4816 182.6071 253.3167
frequency: 160.4809 182.5953 253.3161 291.7548 307.5402 403.3001 409.3303 443.1434 504.7461 565.5520 598.4027 737.6059 748.2960 824.0973 834.4541 883.7795 939.6609 975.3710 1018.0399 1041.5105 1059.9613 1185.6172 1210.7714 1292.2296 1324.5722 1331.5102 1393.2202 1413.3495 1471.7798 1474.0177 1485.0557 1565.2171 1587.7481 1636.0585 2955.4761 3025.0277 3087.8509 3099.7380 3126.3583 3151.3273 3569.4033 3709.3993
redmass: 2.6404 1.1004 3.4014 2.7013 1.1472 2.8951 1.1752 2.4441 5.0256 5.2818 6.5361 2.6389 4.4708 1.3792 5.1283 1.4607 1.3807 1.6885 1.6166 1.5249 1.7517 1.9568 2.6401 1.9105 1.7233 4.7800 1.2801 2.1367 1.0452 1.1242 2.8177 6.2878 4.8756 1.2094 1.0390 1.0974 1.0959 1.0904 1.0874 1.0979 1.0446 1.1039
irintensity: 5.7157 1.9124 0.3760 0.7842 199.9747 0.4133 106.5632 0.2880 5.7915 6.1523 0.9425 4.0517 1.0548 51.5475 2.0362 5.0657 0.0075 2.8874 10.2163 6.4138 16.9439 8.1960 1.0917 6.7010 34.0907 11.5428 16.8187 19.1115 14.6128 15.4967 69.4868 33.7340 16.3578 167.2507 33.1835 25.6196 14.3577 40.8597 6.2477 30.7493 51.1972 23.1124
temp: 298.150 k
press: 1.00000 atm
elementType: 7 7 6 6 6 6 6 6 1 1 1 1 1 1 1 1
symmnumber: 1
zpe: 342602.5 jmol-1
zpe.correction: 0.130490 hartree
zpe.thermalcorrener: 0.137977 hartree
zpe.thermalcorrenthalpy: 0.138921 hartree
zpe.thermalcorrgfe: 0.099306 hartree
zpe.sumelectzpe: -342.351551 hartree
zpe.sumelectthermal: -342.344065 hartree
zpe.sumelectthermalent: -342.343121 hartree
zpe.sumelectthermalfe: -342.382736 hartree
dipole: -4.5169 -0.1569 -0.0032
dipole: 4.5196
quadrupole: -47.7972 -39.1454 -51.5811
quadrupole: -5.8324 0.0077 -0.0068
quadrupole: -1.6226 7.0292 -5.4066 -5.8324 0.0077 -0.0068
hfenergy: -342.4820419 hartree
pointgroup: C01 [X(C6H8N2)]
dipole: 1.7772297 0.0572781 -0.0012564 debye
dipolederiv: -0.9478916 0.6427927 -0.000423 0.5708346 -0.5516098 0.0001276 -0.0010915 0.0006609 -0.7354111 -0.3497098 -0.1941521 0.0000119 -0.010682 -0.0756983 0.0000066 0.0000084 0.0000173 -0.2386316 0.15481 0.075081 -0.0000135 0.4735331 -0.0447074 0.0000266 0.0000561 0.0000406 -0.0737251 0.7810687 -0.8668269 0.000149 -0.7631679 0.2747874 -0.0000456 0.0000509 -0.0000041 0.1587797 -0.0030559 0.0784176 0.0000264 -0.0981231 0.0758893 -0.0000068 -0.0000131 0.0000018 -0.1146571 -0.1052971 -0.0504844 -0.0000522 -0.0469052 0.054576 0.0000177 -0.0001087 0.0000242 0.0930616 -0.0896524 0.4745089 0.0000048 -0.1281659 0.2796709 0.0000144 0.0000354 -0.0000973 -0.1552356 0.1116769 -0.1737901 -0.0000405 -0.0648174 -0.0579335 0.0000045 -0.0000094 0.0000019 -0.1435788 0.0954725 -0.0442336 0.0000014 -0.0025288 -0.1342961 -0.0000184 0.0000078 -0.0000212 0.1490132 -0.0339231 -0.0268506 0.0905905 0.0317114 0.0711686 -0.0833765 0.1225 -0.0252715 -0.0496009 0.0868697 0.0751899 0.0000067 -0.0350619 -0.1332419 -0.000027 0.0000004 -0.0000343 0.1132205 -0.0338375 -0.0268428 -0.0905311 0.0316855 0.0712007 0.0833548 -0.1224241 0.0252674 -0.0495063 0.0678975 0.0251823 0.0000019 0.0184973 -0.1659543 -0.0000329 0.0000135 -0.0000273 0.14158 -0.068353 0.1110963 0.0000133 0.093202 0.0017594 -0.0000086 0.0000115 0.0000037 0.1552811 0.1652807 -0.0517551 0.0000632 -0.048498 0.1684814 -0.0001272 0.000274 -0.0004281 0.3848724 0.1686444 -0.0473332 0.0001911 -0.0215137 0.1659075 0.0000909 0.0006889 -0.0001339 0.3645381 unknown
polarizability: 97.5625154|-5.6658939|90.2958577|-0.002428|0.0026383|38.3548512 unknown
InChI: InChI=1S/C6H8N2/c1-5-2-3-8-4-6(5)7/h2-4H,7H2,1H3
charge 0 multiplicity 1
16 atoms
N  1.689326 -1.553492 -0.000048
N  -1.906013 -0.605862 0.000019
C  0.655971 0.682661 -0.000033
C  0.551409 -0.744855 -0.000121
C  -0.549281 1.420459 0.000044
C  2.01247 1.359759 0.00004
C  -0.751802 -1.326009 -0.000077
C  -1.798293 0.75616 0.000061
H  -0.516546 2.516023 0.000113
H  2.607651 1.084013 -0.894192
H  1.905987 2.457277 0.000153
H  2.607608 1.083759 0.89421
H  -0.867783 -2.418575 -0.000098
H  -2.74004 1.315462 0.00011
H  1.596925 -2.565099 -0.000721
H  2.621411 -1.152282 -0.001159
