program: Gaussian 09
title: 000137933
version: EM64L-G09RevD.01
frameworkgroup: C1[X(C11H8N2O)]
method: RPBEPBE
basis: SDD
operation: Freq
keyword: #p
keyword: freq=noraman
keyword: PBEPBE/SDD
title: #p freq=noraman PBEPBE/SDD
converged: NO YES NO NO
title: Mulliken charges:
elementType: O N N C C C C C C C C C C C H H H H H H H H
charge: -0.221460 -0.034739 0.011007 0.274867 0.057125 0.072547 -0.317951 -0.337161 -0.242813 -0.231614 -0.222783 -0.334017 -0.291541 -0.242067 0.294797 0.278616 0.230742 0.233604 0.233397 0.290420 0.248517 0.250507
chargesum: 0.00000
title: Mulliken charges with hydrogens summed into heavy atoms:
elementType: O N N C C C C C C C C C C C
charge: -0.221460 -0.034739 0.011007 0.274867 0.057125 0.072547 -0.023155 -0.058545 -0.012071 0.001990 0.010614 -0.043597 -0.043024 0.008440
polarizability: 2.05899605e+02 -5.61933936e-02 1.41190282e+02 1.74518238e+00 5.52621415e-01 5.36836531e+01
1716.lowfreq: -0.0002 0.0006 0.0006 6.9462 7.7577 10.7885 20.8074 35.1215 114.6443
frequency: 19.2479 35.0671 114.6439 134.8085 173.5969 249.1618 285.6306 340.9652 398.5072 399.5818 422.7134 460.9991 550.6301 601.6666 615.5085 655.8041 687.3138 702.0455 742.9703 761.4185 802.3224 863.1335 864.3121 911.0361 954.6175 960.8587 962.1536 979.3128 990.0964 999.4959 1011.5179 1024.8705 1033.2024 1085.8484 1143.5498 1165.4214 1173.9520 1191.6205 1238.6700 1276.6779 1288.5709 1318.5576 1377.2957 1386.3397 1429.6977 1437.5428 1475.2533 1495.8442 1507.6668 1536.8955 1583.7706 1608.0415 3128.5566 3138.1366 3141.7541 3155.2799 3162.7669 3167.2155 3177.5678 3185.1712
redmass: 4.3533 6.4474 4.9534 5.5936 4.4024 5.6858 6.3071 3.2031 3.1076 7.6237 5.8676 4.5217 7.9030 9.4321 6.5278 7.3166 3.5254 1.7609 7.1211 2.4048 1.9164 1.4205 1.4253 6.8653 1.4978 1.4603 1.5469 4.5978 4.8569 1.4780 1.3422 2.6761 2.3747 1.5661 2.4969 2.3250 1.0624 1.1717 10.1373 1.6196 2.7688 1.3639 1.8910 8.1829 2.0355 2.2411 2.2446 7.4071 5.9626 6.6610 6.3685 6.0431 1.0856 1.0883 1.0896 1.0945 1.0981 1.0987 1.0942 1.0957
irintensity: 0.1160 1.4718 1.1178 0.5624 0.3118 4.4265 0.3762 5.3352 1.8470 5.6156 7.5652 10.5368 1.4579 4.7921 0.0698 26.5169 3.5434 89.0359 2.4058 38.6126 2.8708 11.9779 15.4521 61.8366 7.5251 5.7735 1.7857 12.4586 0.7326 3.8125 0.8129 7.0696 6.4296 7.2630 48.0197 10.4222 0.1705 29.3600 15.1988 10.7444 256.4516 6.4134 13.2974 4.8368 20.3758 6.6722 0.1036 4.3619 68.7016 94.3785 9.3535 26.2235 0.6138 1.0390 15.4768 13.4173 41.2290 20.6932 0.4950 20.8823
temp: 298.150 k
press: 1.00000 atm
elementType: 8 7 7 6 6 6 6 6 6 6 6 6 6 6 1 1 1 1 1 1 1 1
symmnumber: 1
zpe: 428782.7 jmol-1
zpe.correction: 0.163315 hartree
zpe.thermalcorrener: 0.174209 hartree
zpe.thermalcorrenthalpy: 0.175153 hartree
zpe.thermalcorrgfe: 0.124418 hartree
zpe.sumelectzpe: -607.712289 hartree
zpe.sumelectthermal: -607.701395 hartree
zpe.sumelectthermalent: -607.700451 hartree
zpe.sumelectthermalfe: -607.751186 hartree
dipole: -0.8753 -3.4751 0.1352
dipole: 3.5862
quadrupole: -68.7412 -78.8072 -83.6634
quadrupole: -7.4700 -1.6093 -0.2851
quadrupole: 8.3294 -1.7366 -6.5928 -7.4700 -1.6093 -0.2851
hfenergy: -607.8756039 hartree
pointgroup: C01 [X(C11H8N2O1)]
dipole: -0.2630161 1.248432 0.6024093 debye
dipolederiv: -0.8245865 0.0177494 0.0093672 0.2810897 -0.7964529 -0.2033733 0.1036006 -0.2316121 -0.4125236 -0.2328115 0.0085678 0.0029492 0.1686229 -0.1875658 0.0199987 0.0426762 0.0235206 -0.2195665 -0.2306705 0.0029941 -0.0117996 0.0164503 -0.2212078 0.0344898 0.0149846 0.0303711 -0.2510059 -0.8541935 0.2786176 0.1384341 0.2661948 -0.1687678 -0.075712 0.1145655 -0.0826468 -0.0592511 1.9572075 -0.1804971 -0.1269995 -0.3705208 0.7673509 0.250041 -0.1861113 0.296694 0.2844235 -0.1355223 0.0480455 0.0825518 -0.2057281 -0.0650928 -0.0914178 -0.0796599 -0.1196936 0.0163687 0.0819537 0.051649 0.0064365 -0.2645706 -0.002706 0.0464308 -0.1094137 0.052127 -0.076144 0.1639059 -0.1877513 -0.0828325 0.140182 0.0192195 0.0375585 0.0747162 0.0501734 -0.0858269 -0.354071 -0.0304297 -0.0068215 -0.0764192 0.1306757 0.1069542 -0.0212427 0.1208855 -0.1224891 0.006632 0.197973 0.0646357 0.2569224 -0.1539834 -0.0091337 0.0832957 -0.0049064 -0.1679959 0.131384 -0.0335003 -0.0226079 -0.0555962 0.0738481 0.0772661 -0.0285159 0.069977 -0.0945132 -0.1073897 -0.0994511 -0.067476 0.0093724 0.140896 0.1080457 0.078372 0.1111952 0.1390796 -0.335576 -0.1064687 -0.0708538 0.2257742 0.2090694 0.1493058 0.1775511 0.1740097 0.1340303 0.3619404 0.1929096 0.1320975 -0.1281223 -0.0250051 -0.0141879 -0.1574407 -0.0437629 -0.0092318 0.1828206 -0.0691733 -0.0059845 -0.1048657 0.0827022 -0.0230805 -0.0052147 -0.0385376 0.1380049 0.1469094 0.0308335 0.0121687 -0.027092 0.0134635 -0.0475327 -0.014953 -0.0555381 0.1343774 0.072131 0.0024335 0.0036818 0.0384603 -0.0866513 -0.0896216 0.0202518 -0.0910394 0.124039 -0.0857945 -0.0812322 -0.0181271 -0.0941174 0.0407705 -0.0384663 -0.0275007 -0.03756 0.1463792 -0.0909504 0.0796664 0.0396507 0.081504 0.0676204 -0.0354081 0.0417665 -0.0366885 0.1400577 0.1451838 -0.0265644 -0.022662 -0.0154803 0.0733828 -0.0624476 -0.0564168 -0.0491557 0.0876613 0.0692597 -0.0153583 -0.0071338 -0.0736612 0.0002828 -0.1058275 -0.0517541 -0.1100866 0.0435039 -0.0677622 -0.081013 -0.048675 -0.0683991 0.088151 -0.0338815 -0.0135567 -0.0277258 0.1106228 unknown
polarizability: 205.5357733|-1.0785|121.8436047|-6.1028785|36.4941662|73.3941618 unknown
InChI: InChI=1S/C11H8N2O/c14-11(9-4-2-1-3-5-9)10-8-12-6-7-13-10/h1-8H
charge 0 multiplicity 1
22 atoms
O  -0.074491 -2.031673 -1.031467
N  1.525856 0.776538 0.592227
N  3.719723 -0.459439 -0.757011
C  -1.324313 -0.177473 -0.144572
C  -0.046786 -0.87599 -0.494059
C  1.330326 -0.277034 -0.263185
C  -1.40901 1.155047 0.351065
C  -2.528186 -0.911472 -0.35881
C  -2.669295 1.732592 0.617161
C  -3.780813 -0.332769 -0.086915
C  -3.856195 0.995297 0.401557
C  2.434142 -0.87586 -0.940701
C  2.811062 1.193914 0.777119
C  3.900383 0.576129 0.119184
H  -0.491016 1.713831 0.541382
H  -2.448307 -1.933544 -0.743176
H  -2.724046 2.758855 0.996573
H  -4.697148 -0.909154 -0.254278
H  -4.83172 1.448715 0.611238
H  2.265687 -1.703876 -1.633524
H  2.961843 2.031945 1.465179
H  4.931003 0.904823 0.287313
