program: Gaussian 09
title: 000137927
version: EM64L-G09RevD.01
frameworkgroup: C1[X(C9H16)]
method: RPBEPBE
basis: SDD
operation: Freq
keyword: #p
keyword: freq=noraman
keyword: PBEPBE/SDD
title: #p freq=noraman PBEPBE/SDD
converged: YES YES NO NO
title: Mulliken charges:
elementType: C C C C C C C C C H H H H H H H H H H H H H H H H
charge: 0.363921 -0.461151 -0.453342 -0.527924 -0.757582 -0.758455 0.431611 -0.403403 -0.822655 0.205584 0.200143 0.202719 0.207609 0.205036 0.219354 0.211752 0.209959 0.210754 0.208338 0.236125 0.206786 0.203424 0.218724 0.216926 0.225748
chargesum: 0.00000
title: Mulliken charges with hydrogens summed into heavy atoms:
elementType: C C C C C C C C C
charge: 0.363921 -0.055424 -0.043015 -0.103534 -0.125117 -0.107206 0.431611 -0.199979 -0.161258
polarizability: 1.08776345e+02 -6.42825418e+00 9.44433255e+01 1.73574222e+00 -6.02484722e-01 7.72107741e+01
1716.lowfreq: -12.8696 -11.0270 -0.0009 -0.0006 -0.0002 21.0341 92.5524 163.2927 196.1117
frequency: 92.5092 163.2868 196.0984 224.7771 240.6329 255.0725 271.6738 312.9413 317.9315 391.3271 404.3709 428.3606 442.0253 525.8491 655.2529 705.3908 761.2133 802.8860 869.7169 885.6306 920.5298 937.0921 945.1571 970.7548 1001.5634 1010.0630 1043.4066 1049.5993 1073.6135 1127.3619 1156.8860 1158.1457 1196.2537 1212.7260 1269.4247 1281.5136 1314.0791 1323.0504 1340.9850 1367.8264 1374.3765 1391.9519 1393.0265 1452.0233 1453.9138 1459.0598 1460.9169 1468.9175 1472.0884 1474.6953 1479.6436 1491.8766 1695.4015 2937.4739 2946.8973 2955.1611 2961.0078 2964.7560 2970.4521 2986.7984 2994.1878 3023.8004 3026.0292 3055.5849 3059.2937 3061.5100 3074.0445 3074.2154 3088.9670
redmass: 2.6971 1.1339 1.5055 1.1044 1.8477 1.6709 1.6509 2.4565 2.2831 1.9959 2.1200 2.1811 2.7241 3.7675 3.3128 3.3771 1.9342 1.2714 2.0478 1.8751 2.0627 1.3993 1.5440 1.5703 1.7095 1.3613 1.7111 1.5506 1.9118 1.6316 1.6166 1.4286 2.4936 1.6214 1.8832 1.7549 1.5183 1.4511 1.8125 1.8728 1.2075 1.2386 1.2247 1.0876 1.0693 1.0652 1.0540 1.0546 1.0705 1.0697 1.0593 1.0595 6.5020 1.0621 1.0593 1.0399 1.0374 1.0540 1.0428 1.0966 1.0925 1.0970 1.1022 1.0995 1.0992 1.0985 1.0987 1.0980 1.0905
irintensity: 0.0965 1.0887 0.0466 0.0091 0.6451 1.8876 0.4752 0.1340 0.5685 1.5892 0.0773 2.6880 2.1690 0.2849 0.3014 1.1689 5.8781 10.0913 1.0070 1.2067 4.4122 1.8118 1.6804 0.9017 1.3914 3.3181 7.3990 4.5294 11.6637 1.1996 1.1782 3.7419 8.9670 4.8610 1.1870 1.9109 2.1660 3.6236 1.6795 5.3731 22.4530 3.8215 21.8617 3.3679 8.8196 5.4149 8.1443 1.3077 20.4935 10.8397 7.9287 9.7854 1.5974 44.4449 21.7059 75.3280 27.8778 48.9355 33.2796 31.6141 42.2496 18.9236 57.7306 5.1963 45.7395 74.6204 41.2433 25.5228 45.6119
temp: 298.150 k
press: 1.00000 atm
elementType: 6 6 6 6 6 6 6 6 6 1 1 1 1 1 1 1 1 1 1 1 1 1 1 1 1
symmnumber: 1
zpe: 591523.8 jmol-1
zpe.correction: 0.225300 hartree
zpe.thermalcorrener: 0.235320 hartree
zpe.thermalcorrenthalpy: 0.236264 hartree
zpe.thermalcorrgfe: 0.191427 hartree
zpe.sumelectzpe: -351.819974 hartree
zpe.sumelectthermal: -351.809954 hartree
zpe.sumelectthermalent: -351.809010 hartree
zpe.sumelectthermalfe: -351.853847 hartree
dipole: 0.0280 -0.2679 -0.0289
dipole: 0.2709
quadrupole: -56.9387 -56.1675 -58.8033
quadrupole: -0.6810 0.1385 0.0776
quadrupole: 0.3644 1.1357 -1.5001 -0.6810 0.1385 0.0776
hfenergy: -352.045274 hartree
pointgroup: C01[X(C9H16)]
dipole: -0.0096233 0.1057663 -0.0088052 debye
dipolederiv: 0.1161527 0.0137017 0.0049375 0.0506714 0.0499379 -0.0001369 0.0110335 0.0111359 0.1189724 0.0230413 0.064482 0.0203129 0.0294661 0.0702522 0.0240895 -0.0020963 0.011926 0.094709 -0.0518298 -0.0514985 0.0238963 0.0094417 0.0336822 -0.022307 0.067141 -0.0510997 0.1682994 -0.0751455 -0.0242087 0.0460474 -0.0518407 0.0227907 0.0076039 0.0387108 -0.0300611 0.1910018 -0.0585534 0.0070957 0.0455518 0.0012558 0.0860245 -0.0029535 0.0316178 -0.0041982 0.0407944 0.0102607 0.00468 0.009356 -0.0194479 0.0664896 -0.0114577 0.01239 -0.0148969 -0.0950082 0.2081178 0.0087867 -0.0281475 0.0313365 0.1888062 0.0074176 -0.0170588 0.0342761 -0.1385536 0.0929872 0.0118275 -0.0298871 0.0470328 -0.0219329 -0.0058389 -0.0825298 0.0241369 -0.2654482 -0.1043385 -0.0320525 0.0251606 0.0068479 0.036789 0.0035859 0.0159335 0.0009187 0.1023088 0.0367116 0.0172412 -0.006604 0.0292522 0.0635934 -0.0556679 0.004748 0.003547 -0.1932349 -0.0440375 -0.1395736 -0.0015224 -0.119649 -0.1430388 -0.0014074 -0.0193623 -0.0446144 0.0685951 -0.0278772 0.091962 -0.037864 0.0505174 -0.0751263 0.0927511 -0.075769 0.1429157 0.0090654 -0.0260523 0.059204 0.0502218 -0.0100272 0.0558786 -0.0563465 0.0715127 -0.1178495 -0.1478825 -0.0550636 0.0997016 -0.0780198 0.093404 -0.0558748 0.0680427 -0.0853329 0.127175 0.007083 0.0609833 -0.0524144 0.0178781 -0.0148606 -0.0164075 -0.0704624 0.0410087 -0.1248011 -0.124236 -0.0263661 -0.0792712 -0.0105543 -0.165602 -0.0926253 -0.0426768 -0.0402733 -0.0634322 0.0712827 -0.0076844 0.0773316 -0.0190851 0.1516517 -0.0870664 0.0633744 -0.0565813 0.0871725 0.0502656 0.0733839 -0.0056324 -0.0382628 0.0026179 0.0836523 -0.0206038 0.0293265 -0.0171869 -0.192675 0.0360639 -0.0888011 -0.0387697 -0.1219443 -0.1234852 -0.0848063 -0.0228502 -0.0227151 0.0505287 -0.0925296 -0.0037098 0.1382455 0.0017978 0.0729166 -0.0023821 0.11297 -0.0015373 0.0324475 -0.0111439 0.0980384 -0.0934528 0.1318583 -0.0502055 0.1041237 -0.0509936 0.043818 0.0267786 -0.0759882 -0.126273 0.0085293 -0.1215813 -0.095934 0.0030001 0.0203355 0.0132076 0.1486595 -0.0310394 0.0608285 -0.0451458 0.0870347 0.0281816 0.1038926 -0.121736 0.1056329 -0.0467608 0.0189828 0.037011 0.0240719 0.0588644 0.0241093 -0.123096 0.1060887 -0.1221704 -0.0769249 0.0109641 -0.0484565 0.0131061 -0.1580975 -0.1214075 0.0222616 0.0117667 0.0087006 0.099932 unknown
polarizability: 108.5450522|-6.5738849|94.5890152|-2.2365745|1.1087314|77.2963777 unknown
InChI: InChI=1S/C9H16/c1-8-4-6-9(2,3)7-5-8/h4H,5-7H2,1-3H3
charge 0 multiplicity 1
25 atoms
C  1.326878 -0.009427 0.020956
C  0.544645 1.171772 -0.62394
C  0.560002 -1.328454 -0.296005
C  -0.899131 1.297282 -0.088115
C  2.750717 -0.07731 -0.583465
C  1.436015 0.183628 1.557348
C  -1.625734 -0.040489 -0.027811
C  -0.945782 -1.216971 -0.123561
C  -3.12974 0.016622 0.159723
H  0.50945 1.008322 -1.720523
H  1.094826 2.119445 -0.455856
H  0.948624 -2.142837 0.350839
H  0.787148 -1.642347 -1.338654
H  -1.475224 2.00081 -0.724254
H  -0.894889 1.753607 0.925197
H  3.338561 0.822523 -0.319197
H  3.300049 -0.961857 -0.207518
H  2.711987 -0.14566 -1.687528
H  1.882302 1.166982 1.800915
H  0.448124 0.121917 2.047745
H  2.079701 -0.599543 2.001277
H  -1.508919 -2.161388 -0.082029
H  -3.617924 0.545504 -0.683537
H  -3.397321 0.576825 1.0786
H  -3.573963 -0.991556 0.234693
