program: Gaussian 09
title: 000137918
version: EM64L-G09RevD.01
frameworkgroup: C1[X(C11H24O)]
method: RPBEPBE
basis: SDD
operation: Freq
keyword: #pfreq=noraman
keyword: PBEPBE/SDD
title: #p freq=noraman PBEPBE/SDD
converged: YES YES NO NO
title: Mulliken charges:
elementType: O C C C C C C C C C C C H H H H H H H H H H H H H H H H H H H H H H H H
charge: -0.458900 -0.375045 -0.462484 -0.383268 0.311170 -0.383448 -0.371554 -0.353655 -0.734050 -0.736083 -0.356481 -0.696606 0.218894 0.205817 0.193115 0.201502 0.188856 0.189822 0.191895 0.194185 0.188443 0.188408 0.188225 0.187724 0.245237 0.198102 0.224597 0.202159 0.235265 0.212611 0.194406 0.194514 0.322361 0.214685 0.209873 0.209706
chargesum: 0.00000
title: Mulliken charges with hydrogens summed into heavy atoms:
elementType: O C C C C C C C C C C C
charge: -0.136539 0.049666 -0.067867 -0.004590 0.311170 0.002632 0.005296 0.022294 -0.066113 -0.086047 0.032439 -0.062341
polarizability: 1.54918746e+02 -1.79327903e+00 1.11419236e+02 -1.73005798e+00 -1.22100481e+00 1.07499776e+02
1716.lowfreq: -23.4102 -4.3304 -0.0004 -0.0002 0.0006 5.2560 19.0345 33.8786 47.0004
frequency: 18.3609 33.6661 46.7667 68.5956 84.9957 115.3113 122.8878 134.9829 151.4199 181.1640 204.7312 226.1370 231.1634 236.5255 313.6623 316.8966 339.8970 353.9436 392.5364 420.4883 454.4482 478.4608 534.2008 720.7338 727.5901 739.6763 749.2707 784.4364 846.0895 869.4318 887.7462 911.8125 925.3920 944.3467 979.8877 994.8998 1006.3693 1023.5964 1040.0586 1064.4438 1077.6102 1079.7219 1082.5328 1107.6085 1125.9386 1176.7932 1189.0364 1211.8340 1222.5187 1227.6246 1255.7182 1261.5917 1279.9212 1282.1428 1292.5460 1294.3078 1298.9198 1329.9249 1344.4023 1351.3506 1352.7569 1360.0931 1374.7792 1386.4308 1391.7920 1446.1893 1458.9737 1460.5100 1461.7134 1464.8411 1466.3706 1471.0845 1472.6230 1476.1218 1478.8771 1484.9601 1488.5559 1490.3752 2941.8129 2946.8586 2949.3023 2952.2303 2959.0999 2967.1682 2969.1428 2971.3139 2973.7734 2981.9110 2988.2439 2993.3596 2998.3447 3002.5338 3019.2673 3034.7757 3045.8234 3061.5276 3067.7993 3070.2067 3084.9081 3092.3325 3102.4200 3538.8178
redmass: 2.6093 2.0789 3.4873 2.9297 1.6579 2.4061 2.9954 1.8437 2.0693 2.8302 1.2331 1.1295 2.6360 1.1202 1.2344 2.5538 1.9730 3.1909 2.3839 2.5497 2.9958 2.8080 3.1569 1.0622 1.1072 2.3571 1.4075 1.2161 1.3353 2.4388 1.8875 1.5090 1.4444 1.4733 1.6771 2.4446 1.2690 2.7543 2.8784 1.8426 1.9343 2.2113 2.0205 1.6929 2.0463 2.1495 1.7205 1.4795 1.7502 1.5695 1.3645 1.3209 1.0354 1.2081 1.0868 1.1796 1.2845 1.4561 1.6278 1.5826 1.6812 1.5538 1.3031 1.2167 1.2622 1.0655 1.0706 1.0700 1.0668 1.0710 1.0625 1.0762 1.0740 1.0428 1.0791 1.0872 1.0897 1.0563 1.0613 1.0589 1.0587 1.0590 1.0590 1.0588 1.0372 1.0363 1.0589 1.0962 1.0984 1.0364 1.0970 1.1012 1.1042 1.1046 1.1040 1.0977 1.1007 1.0993 1.0999 1.0993 1.0994 1.0656
irintensity: 0.1113 0.2067 0.3306 0.0888 0.0785 0.0320 0.9530 0.1997 0.1833 0.9200 1.3690 0.0024 0.2439 6.1101 69.2813 14.5832 81.7004 3.5772 1.5361 5.1790 2.5193 3.5380 2.6735 13.3001 0.1520 2.4006 9.9213 0.5541 1.1235 21.9202 4.9871 6.5045 0.7479 6.1673 0.5857 2.0979 0.0304 0.8339 7.8984 9.8563 2.8661 1.5255 1.8651 22.7529 29.5149 18.9122 9.5917 1.1464 42.1718 11.6278 13.9822 4.0782 0.3115 7.1564 0.2131 2.2821 4.1906 6.1572 7.6543 0.9184 0.6101 7.2575 33.6384 11.2423 20.9212 0.5760 0.8731 0.0910 0.2023 0.7846 3.6025 3.6444 2.8766 12.2862 3.1752 2.8542 35.6125 8.1541 13.0328 15.4373 2.4638 0.3435 32.6572 110.4607 25.0522 34.6304 90.3470 1.6400 2.1724 15.0228 12.4705 1.5234 0.1854 44.6455 139.5736 52.5057 98.6729 55.4117 3.7516 61.8091 32.1027 4.6302
temp: 298.150 k
press: 1.00000 atm
elementType: 8 6 6 6 6 6 6 6 6 6 6 6 1 1 1 1 1 1 1 1 1 1 1 1 1 1 1 1 1 1 1 1 1 1 1 1
symmnumber: 1
zpe: 860528.2 jmol-1
zpe.correction: 0.327758 hartree
zpe.thermalcorrener: 0.344452 hartree
zpe.thermalcorrenthalpy: 0.345397 hartree
zpe.thermalcorrgfe: 0.282002 hartree
zpe.sumelectzpe: -507.765010 hartree
zpe.sumelectthermal: -507.748316 hartree
zpe.sumelectthermalent: -507.747372 hartree
zpe.sumelectthermalfe: -507.810767 hartree
dipole: -0.1809 -1.6861 -0.6881
dipole: 1.8300
quadrupole: -81.7755 -80.0803 -76.8934
quadrupole: -6.2126 -3.0612 -3.7257
quadrupole: -2.1924 -0.4972 2.6897 -6.2126 -3.0612 -3.7257
hfenergy: -508.0927684 hartree
pointgroup: C01 [X(C11H24O1)]
dipole: -0.0754894 -0.6883012 -0.1972959 debye
polarizability: 154.8892036|-2.2256443|111.1352095|-1.6145871|-1.6011183|107.8133441 unknown
InChI: InChI=1S/C11H24O/c1-4-5-6-7-8-9-10-11(2,3)12/h12H,4-10H2,1-3H3
charge 0 multiplicity 1
36 atoms
O  3.800235 0.638438 1.376807
C  1.173215 0.198168 -0.122502
C  2.420614 -0.708372 -0.19719
C  -0.145255 -0.60737 -0.094589
C  3.779217 0.015909 0.019506
C  -1.405828 0.285816 -0.063611
C  -2.724889 -0.518351 -0.018342
C  -3.986845 0.373215 0.006163
C  3.983337 1.203767 -0.936603
C  4.94704 -0.991054 -0.089623
C  -5.305246 -0.432611 0.056694
C  -6.560914 0.465779 0.078912
H  1.244449 0.83213 0.783584
H  1.15673 0.887254 -0.990573
H  2.331359 -1.507007 0.571988
H  2.446236 -1.227436 -1.177471
H  -0.191844 -1.274587 -0.981466
H  -0.148705 -1.273906 0.793889
H  -1.409485 0.945428 -0.956641
H  -1.355892 0.958667 0.817932
H  -2.723134 -1.17461 0.877396
H  -2.77154 -1.194748 -0.897771
H  -3.940414 1.052041 0.88357
H  -3.992489 1.027065 -0.891168
H  3.229163 1.985539 -0.749033
H  3.904117 0.876961 -1.989129
H  4.980723 1.648982 -0.776965
H  4.800978 -1.845683 0.599911
H  5.899219 -0.495262 0.168707
H  5.031041 -1.39734 -1.114504
H  -5.350009 -1.111992 -0.819156
H  -5.298644 -1.084297 0.954414
H  3.713153 -0.086822 2.048487
H  -7.489327 -0.133494 0.117332
H  -6.553355 1.134626 0.960379
H  -6.607009 1.103655 -0.824035
