program: Gaussian 09
title: 000137905
version: EM64L-G09RevD.01
frameworkgroup: C1[X(C22H14O4)]
method: RPBEPBE
basis: SDD
operation: Freq
keyword: #pfreq=noraman
keyword: PBEPBE/SDD
title: #p freq=noraman PBEPBE/SDD
converged: YES YES NO NO
title: Mulliken charges:
elementType: O O O O C C C C C C C C C C C C C C C C C C C C C C H H H H H H H H H H H H H H
charge: -0.194947 -0.194757 -0.202041 -0.202264 0.333484 0.333226 -0.320617 -0.368409 -0.368432 -0.320777 -0.005093 -0.005088 0.324272 0.324537 0.000597 0.000703 -0.326287 -0.326052 -0.352981 -0.353181 -0.235070 -0.235172 -0.227146 -0.227131 -0.222023 -0.222013 0.266933 0.279452 0.279443 0.267207 0.263166 0.262786 0.276931 0.276895 0.235821 0.235804 0.237282 0.237282 0.236835 0.236823
chargesum: 0.00000
title: Mulliken charges with hydrogens summed into heavy atoms:
elementType: O O O O C C C C C C C C C C C C C C C C C C C C C C
charge: -0.194947 -0.194757 -0.202041 -0.202264 0.333484 0.333226 -0.053684 -0.088957 -0.088988 -0.053570 -0.005093 -0.005088 0.324272 0.324537 0.000597 0.000703 -0.063121 -0.063267 -0.076050 -0.076286 0.000752 0.000632 0.010136 0.010151 0.014812 0.014810
polarizability: 4.32830697e+02 -2.07433551e-01 1.86996427e+02 -8.64654754e+00 1.73388117e-01 2.01633370e+02
1716.lowfreq: -1.9379 -0.0006 -0.0002 0.0004 1.3052 11.1728 13.8778 20.0760 21.4011
frequency: 13.5426 19.9418 21.2743 34.2120 35.6775 48.9783 76.7236 99.4744 129.8626 134.8731 145.8861 151.7240 159.6294 216.8357 258.0021 259.2766 276.1106 278.4659 323.3146 345.1875 392.5790 397.0868 397.3706 402.8704 420.2335 425.0666 457.3025 459.4954 500.7686 519.7077 612.8440 612.8947 624.2990 647.6837 647.9502 676.5335 681.4802 688.9077 691.1000 713.5970 725.1528 739.1883 774.5712 794.2711 803.8040 847.5431 850.1472 859.0902 859.2624 859.4590 889.8435 951.7847 951.9728 988.4990 988.5439 993.8654 994.0804 998.5665 1002.3841 1006.4936 1010.8905 1011.1198 1015.7564 1021.1505 1036.4315 1044.0314 1089.0819 1089.1695 1124.8533 1175.5517 1175.6492 1183.6340 1188.0409 1195.3816 1209.9542 1220.6823 1292.2109 1296.5568 1313.0471 1320.8239 1321.0143 1375.9054 1390.4089 1390.4755 1412.7232 1436.5077 1436.5900 1478.6227 1478.8047 1489.9344 1529.6471 1541.7915 1544.7478 1551.5933 1577.1551 1586.8277 1586.9515 1609.4112 1609.4938 1615.9490 3132.9320 3132.9510 3144.4927 3144.5441 3154.8670 3155.1995 3155.7083 3155.7184 3166.6695 3166.7221 3177.9464 3178.7736 3178.9453 3181.2755
redmass: 6.3049 6.3924 5.9704 4.7880 4.6545 3.9245 8.7482 8.4211 10.1712 6.8072 5.3711 5.5832 8.5919 7.0745 7.8775 6.0449 6.7521 8.2342 9.6173 9.7016 3.5595 2.8178 2.8286 3.8774 7.2055 5.2683 3.9990 5.2476 4.1757 7.7037 6.4403 6.4428 7.0343 7.5273 7.0685 5.5030 6.5798 2.2366 1.9101 2.4509 4.0485 2.5918 3.1642 3.7390 2.6125 3.3989 5.4225 1.2519 1.2503 1.2494 2.5541 1.4409 1.4438 5.2093 5.2085 1.4514 1.4492 1.5329 1.3922 3.0768 1.3904 1.3565 4.0380 2.6103 2.5312 2.4958 1.5792 1.5820 1.3834 1.0847 1.0743 1.3284 1.2530 1.1400 2.3522 2.8291 3.9205 4.3395 1.4038 1.3596 1.3602 5.2136 8.6585 8.6488 4.2483 2.3323 2.3288 2.2436 2.2419 2.4160 8.8499 9.2043 10.8220 11.9444 8.0513 6.2917 6.2989 6.0281 6.0284 6.2646 1.0857 1.0857 1.0888 1.0888 1.0897 1.0889 1.0937 1.0937 1.0979 1.0979 1.0951 1.0982 1.0981 1.0966
irintensity: 0.8548 0.9338 0.0005 0.8098 0.0909 0.1157 4.2938 1.1678 2.3360 0.0066 1.1694 1.1855 3.4078 1.4454 32.1751 0.0190 49.8241 1.7584 2.6604 1.6021 0.0424 0.0102 0.1395 0.0752 0.0781 5.5693 0.0097 4.3667 12.9511 26.7119 0.1099 0.2986 0.1455 18.0987 144.9768 19.8422 46.0682 32.6391 55.0485 67.9947 8.2500 0.2893 74.3130 164.6029 39.2490 2.5422 162.0654 2.1930 0.2190 0.2154 26.1712 1.9381 1.7219 3.7901 1.2400 1.9937 1.4392 0.0185 2.4408 4.6165 0.0341 0.1179 0.8359 5.6639 2.3297 4.3717 5.8295 11.2133 8.0647 5.1390 29.2164 22.1005 334.8368 0.2361 495.4339 21.1597 5.0020 21.8992 7.8229 5.5651 3.4749 49.4508 6.3092 7.8187 23.5409 1.6830 54.0472 1.0476 1.7480 20.4861 54.5780 139.5555 192.3092 465.2620 0.1411 13.3101 15.0340 30.0048 11.8572 0.0029 0.2991 0.3408 7.3878 7.0143 0.5857 0.0180 8.6939 13.2508 51.7290 5.5863 3.7872 10.8377 11.0913 0.0498
temp: 298.150 k
press: 1.00000 atm
elementType: 8 8 8 8 6 6 6 6 6 6 6 6 6 6 6 6 6 6 6 6 6 6 6 6 6 6 1 1 1 1 1 1 1 1 1 1 1 1 1 1
symmnumber: 1
zpe: 772085.4 jmol-1
zpe.correction: 0.294072 hartree
zpe.thermalcorrener: 0.315904 hartree
zpe.thermalcorrenthalpy: 0.316848 hartree
zpe.thermalcorrgfe: 0.238657 hartree
zpe.sumelectzpe: -1145.853555 hartree
zpe.sumelectthermal: -1145.831723 hartree
zpe.sumelectthermalent: -1145.830778 hartree
zpe.sumelectthermalfe: -1145.908970 hartree
dipole: -0.0085 5.7676 -0.0326
dipole: 5.7677
quadrupole: -103.9700 -150.0072 -152.9598
quadrupole: -0.0756 -13.2995 0.0172
quadrupole: 31.6757 -14.3616 -17.3141 -0.0756 -13.2995 0.0172
hfenergy: -1146.1476267 hartree
pointgroup: C01 [X(C22H14O4)]
dipole: -0.004499 -2.2691565 0.0111146 debye
polarizability: 432.7418372|0.0813491|186.9960423|9.7639402|0.1588205|201.7226141 unknown
InChI: InChI=1S/C22H14O4/c23-19(15-7-3-1-4-8-15)21(25)17-11-13-18(14-12-17)22(26)20(24)16-9-5-2-6-10-16/h1-14H
charge 0 multiplicity 1
40 atoms
O  -3.061744 0.455979 2.116394
O  3.060257 0.434264 -2.119664
O  -3.862134 1.67268 -0.948765
O  3.864356 1.679857 0.93146
C  -1.363626 0.59266 0.397286
C  1.361944 0.58771 -0.402075
C  -1.023831 0.586423 -0.985651
C  0.325039 0.57758 -1.376089
C  -0.326722 0.597223 1.37129
C  1.022202 0.601322 0.980815
C  -2.777679 0.547795 0.884151
C  2.77591 0.536817 -0.888286
C  -5.104173 -0.21516 -0.073744
C  5.101239 -0.22003 0.07512
C  -3.935208 0.705216 -0.129606
C  3.934039 0.703034 0.123239
C  -5.160799 -1.334935 0.803002
C  5.152101 -1.351319 -0.786991
C  -6.185642 0.030248 -0.967479
C  6.18671 0.034863 0.961289
C  -6.28024 -2.192548 0.77886
C  6.269691 -2.211085 -0.755815
C  -7.301337 -0.826149 -0.984988
C  7.300723 -0.823587 0.985662
C  -7.35066 -1.941155 -0.111231
C  7.344182 -1.950192 0.126614
H  -1.810739 0.602939 -1.743938
H  0.607169 0.569007 -2.433871
H  -0.608805 0.603773 2.429105
H  1.809158 0.629607 1.738706
H  -4.345611 -1.523391 1.506763
H  4.333757 -1.547422 -1.485033
H  -6.122514 0.897118 -1.633889
H  6.127937 0.910531 1.616512
H  -6.32261 -3.051905 1.456318
H  6.30751 -3.079497 -1.421901
H  -8.13144 -0.631883 -1.672445
H  8.134011 -0.621945 1.667113
H  -8.219339 -2.608996 -0.12455
H  8.211519 -2.619646 0.145311
