program: Gaussian 09
title: 000137894
version: EM64L-G09RevD.01
frameworkgroup: C1[X(C9H11N)]
method: RPBEPBE
basis: SDD
operation: Freq
keyword: #pfreq=noraman
keyword: PBEPBE/SDD
title: #p freq=noraman PBEPBE/SDD
converged: YES YES NO NO
title: Mulliken charges:
elementType: N C C C C C C C C C H H H H H H H H H H H
charge: -0.174081 -0.469768 -0.387796 -0.387764 0.400604 -0.378657 -0.378557 -0.210865 -0.210872 -0.272971 0.233980 0.234749 0.217484 0.230016 0.229937 0.217564 0.225580 0.225527 0.216767 0.216781 0.222343
chargesum: 0.00000
title: Mulliken charges with hydrogens summed into heavy atoms:
elementType: N C C C C C C C C C
charge: -0.174081 -0.001039 0.059704 0.059737 0.400604 -0.153077 -0.153030 0.005903 0.005909 -0.050628
polarizability: 1.48522718e+02 -1.69784127e-03 1.03162129e+02 -3.19054464e+00 1.35168039e-02 5.43533744e+01
1716.lowfreq: -15.0724 -9.8377 -6.6341 -0.0009 -0.0008 -0.0008 65.5387 98.8879 145.4556
frequency: 65.5210 98.7138 145.4543 150.5511 228.1080 364.6291 410.3653 454.8681 503.4963 612.2952 669.0340 691.4894 750.8086 765.8858 813.3945 849.3921 862.0613 868.3628 938.0513 941.7589 954.0891 971.9796 975.7763 1014.5917 1042.1050 1070.4961 1102.6973 1109.9467 1133.8724 1163.2478 1168.2337 1184.8335 1194.2921 1244.1038 1273.9474 1304.3306 1322.8176 1384.2006 1384.5222 1448.9150 1465.5775 1481.3779 1500.2099 1507.7728 1576.4696 1623.5050 2947.1319 2954.9997 3020.0338 3021.1740 3052.2093 3117.3048 3121.2518 3125.6574 3138.6737 3143.1876 3163.9239
redmass: 3.5293 2.7196 1.7318 3.3963 4.4469 5.3018 2.9455 3.9848 2.6831 6.4458 5.6426 1.8144 1.7120 1.2042 1.2497 1.1176 3.7951 1.5569 2.9262 2.7176 1.3578 1.3691 4.6036 3.1160 2.6644 1.9092 1.0994 1.5671 2.9641 1.2954 1.0483 1.1133 1.1897 1.4446 1.3356 1.4362 1.3755 6.0141 2.9273 2.6434 1.1093 1.0832 1.2791 2.4274 6.2502 6.1353 1.0594 1.0642 1.1008 1.1039 1.0614 1.0839 1.0868 1.1085 1.0915 1.0963 1.1010
irintensity: 4.9835 0.0637 8.0974 0.0380 5.1383 1.5928 0.0451 2.6654 14.6244 0.1976 1.7781 44.3759 85.0025 4.8016 0.0206 0.0038 2.8829 8.1831 8.1939 3.0083 0.0035 1.0578 6.3645 3.8922 3.3434 1.5476 0.0812 7.7712 23.0345 1.5078 1.4181 12.8209 4.5097 25.8586 0.0159 8.0344 0.0903 10.6899 106.1997 0.0068 22.0287 0.0010 103.6615 107.9417 9.9446 218.9392 110.7919 59.9718 19.2582 65.7523 60.4638 13.8606 1.4487 34.4345 18.9245 51.2847 18.6480
temp: 298.150 k
press: 1.00000 atm
elementType: 7 6 6 6 6 6 6 6 6 6 1 1 1 1 1 1 1 1 1 1 1
symmnumber: 1
zpe: 464113.4 jmol-1
zpe.correction: 0.176771 hartree
zpe.thermalcorrener: 0.185475 hartree
zpe.thermalcorrenthalpy: 0.186420 hartree
zpe.thermalcorrgfe: 0.142628 hartree
zpe.sumelectzpe: -403.539692 hartree
zpe.sumelectthermal: -403.530988 hartree
zpe.sumelectthermalent: -403.530044 hartree
zpe.sumelectthermalfe: -403.573836 hartree
dipole: 2.5900 0.0006 0.5007
dipole: 2.6379
quadrupole: -52.8757 -54.2503 -64.0401
quadrupole: 0.0016 0.0553 0.0032
quadrupole: 4.1796 2.8051 -6.9847 0.0016 0.0553 0.0032
hfenergy: -403.7164631 hartree
pointgroup: C01 [X(C9H11N1)]
dipole: 1.0227005 -0.0038943 -0.176532 debye
dipolederiv: -1.7929258 -0.0017106 -0.0404752 -0.010574 -0.4006899 0.0006741 -0.3807394 0.0008053 -0.3675787 0.0847175 0.0000138 -0.00056 -0.0004302 -0.0695064 0.005902 -0.0165708 0.0059054 0.1664977 0.3716628 -0.2498282 0.017858 -0.4081867 0.4120862 0.0142313 0.0694768 0.0362417 0.3503521 0.37153 0.2506024 0.0052559 0.4116922 0.4101801 -0.0171826 0.0503549 -0.0393163 0.3531845 1.6849751 0.0041479 0.1319633 0.0072324 -0.0818641 0.0065951 0.2534872 0.0064514 0.1758992 -0.4600673 0.0734359 0.0054441 -0.4088414 0.0110806 -0.0394719 0.0000441 -0.0123129 -0.2506568 -0.460275 -0.0735829 0.0086543 0.4075897 0.0135059 0.0273506 -0.0197043 0.0002762 -0.2524907 0.2566509 -0.1225683 0.0394728 0.0091614 0.1982822 -0.0051529 0.037043 -0.0196134 -0.1353434 0.2564191 0.1242694 0.0338423 -0.0073173 0.1988645 -0.0099028 0.0373314 0.0044834 -0.1357896 -0.1596559 0.0005937 0.0180068 0.0002307 -0.3078945 0.0016566 0.005309 0.001608 -0.2340723 -0.0657297 -0.0023874 -0.0934599 -0.0038194 0.0850057 -0.0032279 -0.1528619 -0.0032881 -0.0437069 -0.0364374 0.0021185 0.086165 0.0039686 0.0846019 -0.0037939 0.1586327 -0.0037563 -0.0677523 -0.0117648 -0.0360255 -0.0547338 0.0966235 -0.0711585 -0.0975769 0.0707301 -0.1500952 -0.1185946 0.0211093 0.0084707 -0.0078237 0.1168888 -0.1015243 0.1082362 -0.04972 0.1419624 -0.0667325 0.0213407 -0.0088667 -0.0072908 -0.1190234 -0.1141629 -0.1058557 -0.0437403 -0.1396264 -0.0542145 -0.0118689 0.0332065 -0.0565452 -0.0931756 -0.0588386 0.0944103 0.0754787 0.147158 -0.1309229 0.0209017 0.1104116 -0.0207978 0.0935447 -0.0535858 0.0139468 -0.0214028 0.0170181 0.1656186 0.0211454 -0.111172 -0.0156985 -0.0942657 -0.0548382 -0.0039466 -0.017143 -0.0071332 0.1665385 0.0193521 -0.0960026 -0.0077489 -0.1173022 -0.0912529 -0.0034966 -0.0097801 -0.0028165 0.1517433 0.0190603 0.0957122 -0.0121062 0.1168835 -0.0901519 0.0144668 -0.0149693 0.0138889 0.1509699 -0.1501402 -0.0008385 -0.0294226 -0.0008798 0.081861 0.0021381 -0.0312562 0.0021593 0.1770515 unknown
polarizability: 148.3576383|0.1407744|103.1362889|5.0672869|-1.1211962|54.5442948 unknown
InChI: InChI=1S/C9H11N/c1-2-5-9(6-3-1)10-7-4-8-10/h1-3,5-6H,4,7-8H2
charge 0 multiplicity 1
21 atoms
N  1.269334 0.006586 0.28648
C  3.371384 -0.001357 -0.064986
C  2.246115 -1.090508 0.058837
C  2.245217 1.091684 0.00405
C  -0.112163 0.00205 0.132982
C  -0.834816 -1.228916 0.090274
C  -0.836609 1.228775 0.034304
C  -2.237828 -1.222986 -0.04401
C  -2.239592 1.214792 -0.09944
C  -2.955183 -0.006194 -0.140554
H  4.063383 0.020278 0.79054
H  3.945428 -0.024737 -1.002982
H  2.061854 -1.664839 -0.873546
H  2.346217 -1.800077 0.901112
H  2.344982 1.842916 0.809452
H  2.06043 1.617967 -0.956147
H  -0.294156 -2.179141 0.170071
H  -0.29714 2.182345 0.070846
H  -2.776029 -2.177979 -0.073745
H  -2.779134 2.166692 -0.172424
H  -4.045193 -0.009351 -0.244215
