program: Gaussian 09
title: 000137859
version: EM64L-G09RevD.01
frameworkgroup: C1[X(C7H8)]
method: RPBEPBE
basis: SDD
operation: Freq
keyword: #p
keyword: freq=noraman
keyword: PBEPBE/SDD
title: #p freq=noraman PBEPBE/SDD
converged: NO NO NO NO
title: Mulliken charges:
elementType: C C C C C C C H H H H H H H H
charge: -0.470571 -0.193775 -0.193765 0.563564 -0.362347 -0.362354 -0.734730 0.225739 0.225726 0.212442 0.212440 0.224989 0.224991 0.213826 0.213825
chargesum: 0.00000
title: Mulliken charges with hydrogens summed into heavy atoms:
elementType: C C C C C C C
charge: -0.019106 0.018667 0.018675 0.563564 -0.137358 -0.137363 -0.307080
polarizability: 1.25312825e+02 -6.16364752e-05 6.69651273e+01 -5.10335123e-04 -2.05255499e-04 3.50004864e+01
1716.lowfreq: -10.2022 -10.0104 -0.0008 -0.0006 0.0006 21.9505 123.5656 308.8009 358.9567
frequency: 123.5422 308.8000 358.9526 372.5348 492.9150 557.9906 587.2501 657.1863 772.0325 783.4334 801.9609 876.8617 926.1664 940.6194 943.3764 948.6677 982.7913 990.4860 1015.4741 1150.9493 1169.2456 1198.5864 1314.2553 1347.8407 1359.2878 1405.8242 1432.7006 1449.7513 1598.2457 1621.1365 1683.4434 2932.8933 2958.0614 3096.4072 3103.1789 3105.1890 3131.2745 3137.3964 3197.6696
redmass: 2.3250 2.3816 2.3690 2.7291 5.7148 1.4991 6.7224 1.0552 5.2442 1.2007 1.9202 3.0925 1.4056 1.7503 1.7057 4.3015 1.2727 1.4279 1.5346 1.0818 1.1004 1.0654 1.4600 1.9343 1.4463 3.2268 1.1108 1.2843 3.9056 7.2846 6.4337 1.0598 1.0963 1.0613 1.0841 1.0851 1.0983 1.1000 1.1143
irintensity: 1.2451 0.6935 0.6226 0.0000 0.0054 64.8457 0.4695 0.0000 0.0641 0.0000 19.8089 20.8407 43.8227 1.0657 79.2450 1.2303 0.0000 4.2932 5.1158 1.3482 0.0000 2.1420 0.4029 4.9204 1.0795 2.6379 20.3665 0.5166 20.5753 0.7861 15.7001 41.8641 21.4424 3.3164 0.3853 10.8061 77.4258 1.3087 19.3172
temp: 298.150 k
press: 1.00000 atm
elementType: 6 6 6 6 6 6 6 1 1 1 1 1 1 1 1
symmnumber: 1
zpe: 327982.4 jmol-1
zpe.correction: 0.124922 hartree
zpe.thermalcorrener: 0.130973 hartree
zpe.thermalcorrenthalpy: 0.131917 hartree
zpe.thermalcorrgfe: 0.095313 hartree
zpe.sumelectzpe: -270.990539 hartree
zpe.sumelectthermal: -270.984488 hartree
zpe.sumelectthermalent: -270.983543 hartree
zpe.sumelectthermalfe: -271.020148 hartree
dipole: 1.1617 0.0000 0.0002
dipole: 1.1617
quadrupole: -37.1759 -37.8006 -46.5080
quadrupole: -0.0001 0.0004 -0.0001
quadrupole: 3.3189 2.6942 -6.0131 -0.0001 0.0004 -0.0001
hfenergy: -271.1154608 hartree
pointgroup: C01 [X(C7H8)]
dipole: 0.4570523 -0.0000145 0.0000777 debye
dipolederiv: -0.2481312 -0.000002 -0.0000584 -0.0000009 -0.0850792 -0.0000032 -0.0004228 -0.0000025 0.2437162 0.1931716 0.0278385 0.0000332 0.1368476 0.1164025 0.0000898 0.0001901 0.0000632 -0.2239798 0.1931556 -0.0278476 0.0000371 -0.1368549 0.1164237 -0.0000862 0.0001923 -0.0000595 -0.2239821 0.330039 -0.0000079 -0.0000633 -0.0000077 0.1354162 0.0000024 0.0000434 0.0000025 0.1121409 -0.0749066 0.0179301 0.0000269 0.0222571 0.0837668 0.0000673 -0.000052 0.0000714 -0.1860113 -0.0749121 -0.0179111 0.0000317 -0.0222416 0.0837755 -0.0000742 -0.0000555 -0.0000797 -0.1860155 -0.3743542 0.0000158 -0.0000572 0.0000146 0.0294512 -0.0000138 -0.0000262 -0.0000129 -0.4928871 -0.0341112 0.0000065 -0.1131501 0.0000084 0.0535242 0.0000083 -0.1784593 0.0000093 -0.030952 -0.0342772 0.0000043 0.1131867 0.0000082 0.0534989 -0.0000046 0.1785055 -0.0000067 -0.0307582 0.0238451 0.0862667 0.0000056 0.0896829 -0.1203662 -0.0000306 0.0000362 -0.0000462 0.1524207 0.0238397 -0.0862677 0.0000031 -0.089697 -0.1203666 0.0000284 0.000035 0.0000434 0.1524213 0.0112494 -0.1141728 -0.0000267 -0.0435235 -0.0925585 -0.0000443 -0.0000129 -0.0000397 0.1586628 0.0112645 0.1141546 -0.0000303 0.0435151 -0.0925741 0.0000491 -0.0000143 0.0000461 0.1586642 0.0270689 0.0587493 0.0000294 0.098053 -0.080662 -0.0000082 0.000018 0.0000067 0.1982804 0.0270587 -0.0587566 0.000032 -0.0980614 -0.0806523 0.0000198 0.0000225 0.0000045 0.1982795 unknown
polarizability: 125.3128246|-0.0020371|66.9651274|-0.0005103|-0.0002052|35.0004864 unknown
InChI: InChI=1S/C7H8/c1-7-5-3-2-4-6-7/h3-6H,1-2H2
charge 0 multiplicity 1
15 atoms
C  1.908982 -0.000051 0.000327
C  1.075407 -1.264769 0.00002
C  1.075499 1.264704 0.000022
C  -1.068708 0.000046 0.000043
C  -0.289399 -1.253353 -0.000072
C  -0.28931 1.253388 -0.00009
C  -2.443011 0.000092 0.000264
H  2.589511 -0.000103 0.880669
H  2.590267 -0.000082 -0.879414
H  1.618232 -2.219648 -0.000109
H  1.618349 2.21957 -0.00009
H  -0.849074 -2.197649 -0.000278
H  -0.848895 2.197734 -0.000321
H  -3.018743 0.932916 0.000342
H  -3.018808 -0.932694 0.000387
