program: Gaussian 09
title: 000137840
version: EM64L-G09RevD.01
frameworkgroup: C1[X(C8H15ClO2)]
method: RPBEPBE
basis: SDD
operation: Freq
keyword: #p
keyword: freq=noraman
keyword: PBEPBE/SDD
title: #p freq=noraman PBEPBE/SDD
converged: NO YES NO NO
title: Mulliken charges:
elementType: Cl O O C C C C C C C C H H H H H H H H H H H H H H H
charge: -0.085261 -0.263018 -0.244586 -0.367798 -0.346127 -0.264839 -0.481567 -0.332176 -0.686095 0.255302 -0.587560 0.208741 0.207170 0.196673 0.197290 0.221764 0.223279 0.264459 0.236984 0.226297 0.249867 0.211866 0.212574 0.219001 0.272916 0.254844
chargesum: 0.00000
title: Mulliken charges with hydrogens summed into heavy atoms:
elementType: Cl O O C C C C C C C C
charge: -0.085261 -0.263018 -0.244586 0.048114 0.047836 0.180204 0.019875 0.143988 -0.042653 0.255302 -0.059801
polarizability: 1.29570056e+02 -7.93695348e-01 9.75803123e+01 2.67932486e-01 1.94492211e+00 7.98684171e+01
1716.lowfreq: -19.2092 -4.7075 -0.0017 -0.0014 0.0002 1.2795 8.2725 31.2423 44.9049
frequency: -16.2794 31.0985 44.8626 56.4119 77.2300 105.4233 110.6376 161.6715 175.7761 220.1752 231.9165 251.6491 280.6561 402.6309 409.8896 474.2615 549.6675 594.0090 679.2659 739.2919 774.0577 796.1297 850.2879 865.5844 910.4979 931.1956 944.7795 981.7197 1032.2524 1041.6671 1082.1227 1097.2987 1124.9735 1128.5478 1144.1404 1147.0644 1192.3974 1212.1521 1261.8868 1270.7275 1273.0079 1287.5949 1294.7361 1305.5063 1344.3143 1368.4014 1379.1721 1392.1064 1440.5588 1451.4427 1452.9171 1468.8025 1472.5838 1477.8333 1480.5739 1490.7576 1636.2120 2970.5850 2976.7441 2990.5311 2992.4302 2997.0461 3001.1557 3014.1410 3044.3455 3045.0119 3050.3802 3069.9790 3073.7271 3077.7211 3078.9306 3133.5910
redmass: 3.7184 6.3583 2.6084 3.4555 2.3519 2.2384 3.3885 3.4686 2.4716 2.6921 1.1793 5.0635 3.4231 3.6620 2.9765 4.6603 2.6219 4.2150 5.0319 1.0693 1.5306 1.1395 2.1633 3.4311 1.9174 1.1646 4.1011 2.2713 1.7615 3.2821 2.2296 2.0072 2.6245 2.6136 1.4183 1.4747 1.4322 1.3474 1.1829 1.2115 1.2329 1.0802 1.3290 1.2592 1.4348 1.5595 1.7225 1.2224 1.0828 1.0933 1.1019 1.0796 1.0639 1.0420 1.0659 1.0916 9.6690 1.0586 1.0367 1.0648 1.0599 1.0619 1.0569 1.1004 1.0903 1.1038 1.0650 1.1041 1.0958 1.0994 1.1048 1.1107
irintensity: 1.9963 1.2011 0.4826 0.9205 1.1880 0.0586 2.9433 0.8811 8.1790 0.9703 0.4223 10.6968 1.2009 19.3930 3.2009 0.5293 1.0265 20.7466 4.1892 9.3281 26.8364 0.7908 2.2177 11.8767 2.7862 0.4463 57.3619 11.0509 6.1249 30.8076 26.5470 6.1684 3.0559 270.2795 47.8882 3.6355 61.8917 0.0174 6.8386 0.3058 0.6442 0.0745 58.9144 65.0480 0.9685 14.0624 8.5553 9.2686 6.0261 43.1176 4.3833 0.5469 0.4574 13.1430 5.1726 20.3360 178.0967 28.5244 30.1382 7.0517 10.8189 12.0902 51.0253 7.1763 9.6975 0.9547 14.2786 1.5402 19.2335 48.9567 131.1922 18.3350
temp: 298.150 k
press: 1.00000 atm
elementType: 17 8 8 6 6 6 6 6 6 6 6 1 1 1 1 1 1 1 1 1 1 1 1 1 1 1
symmnumber: 1
zpe: 573722.1 jmol-1
zpe.correction: 0.218519 hartree
zpe.thermalcorrener: 0.231596 hartree
zpe.thermalcorrenthalpy: 0.232540 hartree
zpe.thermalcorrgfe: 0.176491 hartree
zpe.sumelectzpe: -923.467179 hartree
zpe.sumelectthermal: -923.454103 hartree
zpe.sumelectthermalent: -923.453159 hartree
zpe.sumelectthermalfe: -923.509207 hartree
dipole: 1.6979 0.3256 1.7443
dipole: 2.4559
quadrupole: -69.6250 -81.7611 -72.7853
quadrupole: -7.1028 -6.0661 2.7302
quadrupole: 5.0988 -7.0373 1.9385 -7.1028 -6.0661 2.7302
hfenergy: -923.6856985 hartree
pointgroup: C01 [X(C8H15Cl1O2)]
dipole: 0.6481411 0.0918003 0.7107014 debye
dipolederiv: -0.3050587 -0.0850514 -0.0312573 -0.1631662 -0.4553735 -0.1462522 -0.0950199 -0.1839588 -0.3054489 -1.8244406 0.2709183 -0.0270805 0.3604367 -0.5341321 0.0685005 -0.0287802 0.0705507 -0.2942127 -0.7405885 -0.0746603 0.0328099 0.3324827 -0.8665136 0.1651272 -0.0735015 0.1872623 -0.3477412 -0.1230586 0.0273613 0.0082941 -0.00602 0.0557139 0.0256728 0.0216281 0.0267283 0.1445227 0.0716812 0.0282444 -0.0010299 0.1210752 0.0818222 0.0268528 -0.0303688 0.029902 0.1721326 0.8994899 -0.0241908 -0.0146125 0.1165112 0.2399215 0.0361105 -0.0729396 0.0381118 0.3451045 -0.2789397 -0.0880649 0.060613 -0.227489 -0.1585745 0.0583272 0.0798035 0.0682686 0.116961 0.0189104 -0.0249672 0.0154983 -0.1704508 -0.0662512 -0.0142497 -0.0128382 -0.0393034 0.0423484 -0.0507828 0.0542334 -0.0080646 0.0071128 0.0476237 0.0123181 0.0082728 0.0102004 0.0902966 1.8155051 -0.1013275 -0.0237348 -0.6016902 1.1465795 -0.2764814 0.0988968 -0.3003432 0.2634176 0.2437971 0.142613 0.081105 0.2288648 0.5843866 0.253066 0.0981834 0.2391835 0.3864027 0.0558667 -0.0278191 -0.0120667 -0.0154012 -0.0850661 -0.0961184 -0.0279958 -0.1122319 0.0021621 0.0592841 -0.0048748 0.0055793 0.0115009 0.0417737 0.067555 0.0113843 0.0856637 -0.1336132 0.0326142 -0.0013832 -0.0021448 -0.0335399 -0.1259046 -0.1096978 -0.019338 -0.1355594 -0.0033795 0.0352924 0.0146023 -0.0190297 -0.0050292 0.0301697 0.0870328 0.0138146 0.1097015 -0.1608493 -0.0447952 -0.0003483 0.0048413 -0.0678165 -0.0592231 -0.0807236 0.0047522 -0.1001685 -0.0081188 -0.0414022 0.0062886 -0.0124757 -0.0496666 0.0438345 0.0487312 0.0298876 0.0625935 -0.1093805 0.0982559 0.0033426 0.0132701 0.068412 0.0242391 -0.0640674 0.0274855 -0.077593 0.0522595 0.0357146 0.0015655 -0.0074738 0.0398515 0.0830718 0.0551475 -0.0234005 0.0773472 -0.0689998 0.0404713 -0.058357 -0.0248502 0.0268735 -0.0410315 -0.1103991 0.0239556 -0.095856 0.0258085 0.0519509 -0.0051008 -0.0030355 0.0424961 0.0801567 0.0573057 -0.0091462 0.0852022 -0.068345 0.0869663 0.0047199 0.0296563 0.0357424 0.047872 0.0693933 -0.0266475 0.0958433 -0.1548058 0.0818986 -0.0393726 -0.0434275 0.0213778 -0.097293 -0.1115855 -0.0171144 -0.1314806 -0.0020144 -0.2013723 -0.053783 0.0383794 -0.0849334 0.0453237 0.0247251 0.0495279 0.0221363 0.0913672 -0.1085855 0.0481268 -0.013091 0.0641698 -0.0369012 -0.0606334 -0.0357626 -0.0471816 0.0574307 0.0913254 -0.0127151 -0.0466722 -0.0517046 -0.0262242 0.0143427 0.0052608 0.0149813 -0.1333051 unknown
polarizability: 129.5396118|0.8448041|96.9934289|1.0948334|3.7572378|80.4857449 unknown
InChI: InChI=1S/C8H15ClO2/c1-2-3-7-11-8(10)5-4-6-9/h2-7H2,1H3
charge 0 multiplicity 1
26 atoms
Cl -4.648158 -1.641115 -0.690157
O  0.540936 -0.15528 0.178098
O  -0.586671 1.805784 -0.385902
C  2.9485 -0.498167 0.130162
C  4.348973 0.09391 -0.157619
C  1.83986 0.523928 -0.118922
C  -1.850195 -0.206056 0.319208
C  -3.144725 0.609406 0.153462
C  5.479221 -0.928977 0.085192
C  -0.611293 0.611473 -0.005201
C  -4.406906 -0.177106 0.497429
H  2.777287 -1.383918 -0.511093
H  2.896633 -0.845775 1.1798
H  4.512815 0.985201 0.481446
H  4.391046 0.449723 -1.207026
H  1.929234 1.410651 0.536128
H  1.819459 0.873752 -1.167951
H  -1.867473 -1.096124 -0.338035
H  -1.749287 -0.596645 1.350641
H  -3.112401 1.496177 0.818746
H  -3.212051 1.002626 -0.876073
H  5.481493 -1.275585 1.135505
H  5.35467 -1.817652 -0.561313
H  6.470705 -0.490647 -0.128874
H  -5.318628 0.427114 0.380785
H  -4.371743 -0.631697 1.500065
