program: Gaussian 09
title: 000011617
version: EM64L-G09RevD.01
frameworkgroup: C1[X(C6H10S)]
method: RPBEPBE
basis: SDD
operation: Freq
keyword: #pfreq=noraman
keyword: PBEPBE/SDD
title: #p freq=noraman PBEPBE/SDD
converged: YES YES NO NO
title: Mulliken charges:
elementType: S C C C C C C H H H H H H H H H H
charge: 0.167222 -0.728749 -0.728728 0.002795 0.002765 -0.548386 -0.548350 0.258844 0.258464 0.258850 0.258456 0.232698 0.232694 0.221169 0.219544 0.221172 0.219541
chargesum: 0.00000
title: Mulliken charges with hydrogens summed into heavy atoms:
elementType: S C C C C C C
charge: 0.167222 -0.211441 -0.211422 0.235494 0.235459 -0.107673 -0.107638
polarizability: 1.47673345e+02 -1.33767542e-02 5.67045700e+01 1.36183095e+01 -9.48799476e-03 6.23871424e+01
1716.lowfreq: -0.2763 0.0018 0.0022 0.0035 6.1618 18.1255 28.4370 55.5392 67.8740
frequency: 28.2695 55.5326 67.8728 107.8980 155.6313 258.1639 292.7702 399.5336 401.3568 553.5192 564.9282 715.7088 740.2865 880.7613 880.9561 931.1255 945.9716 947.9499 949.5580 1002.4998 1002.7393 1076.6554 1077.3764 1193.2761 1199.0077 1216.9279 1250.9942 1290.2464 1292.0976 1418.1591 1418.9498 1452.9820 1453.7320 1651.1554 1652.4169 3006.1031 3006.4465 3080.6267 3084.5354 3091.5085 3091.7212 3115.4142 3115.8220 3202.4584 3202.4733
redmass: 4.8326 2.3686 3.4653 3.2166 2.8092 3.0542 2.4784 2.2395 2.0144 1.9479 2.3159 2.3413 2.5294 1.3651 1.3473 2.0887 1.6551 1.3330 1.5097 1.1205 1.1240 1.3315 1.3584 1.4675 1.5425 1.2102 1.2077 1.2178 1.2231 1.1504 1.1517 1.1313 1.1397 4.5543 4.5708 1.0576 1.0566 1.1033 1.1010 1.0617 1.0643 1.0956 1.0962 1.1147 1.1147
irintensity: 0.4760 0.0003 0.3356 0.5935 0.0451 0.4330 3.7043 1.1481 0.3044 7.2334 3.7487 33.5476 16.4451 2.7175 16.6401 3.8536 42.2523 37.8952 85.0145 25.5555 8.8961 8.6673 0.0243 1.5927 0.0033 25.5515 2.9286 0.8378 0.0275 13.7281 2.1705 6.3238 7.6072 0.8022 22.2643 1.0444 48.0427 15.9905 0.0005 27.0388 0.0053 26.5524 0.9097 29.3957 25.3046
temp: 298.150 k
press: 1.00000 atm
elementType: 16 6 6 6 6 6 6 1 1 1 1 1 1 1 1 1 1
symmnumber: 1
zpe: 367996.0 jmol-1
zpe.correction: 0.140162 hartree
zpe.thermalcorrener: 0.149489 hartree
zpe.thermalcorrenthalpy: 0.150433 hartree
zpe.thermalcorrgfe: 0.104203 hartree
zpe.sumelectzpe: -632.084833 hartree
zpe.sumelectthermal: -632.075507 hartree
zpe.sumelectthermalent: -632.074563 hartree
zpe.sumelectthermalfe: -632.120793 hartree
dipole: 0.0001 1.7530 0.0014
dipole: 1.7530
quadrupole: -46.2311 -53.4395 -48.7766
quadrupole: -0.0010 0.4760 -0.0052
quadrupole: 3.2513 -3.9571 0.7058 -0.0010 0.4760 -0.0052
hfenergy: -632.2249957 hartree
pointgroup: C01 [X(C6H10S1)]
dipole: 0.0000604 0.6896855 -0.002803 debye
dipolederiv: -0.4095951 -0.0000685 -0.0144642 0.0001042 -0.027379 -0.0006121 0.028334 -0.0006128 -0.1780567 0.2738172 -0.1475617 0.0581682 -0.2936269 0.1256088 0.0098112 0.0309764 -0.0037964 0.1245502 0.2739111 0.1480339 0.0569998 0.2937304 0.1256125 -0.0098311 0.0285774 0.0038415 0.1245659 0.1254195 0.1129671 0.0395097 0.3393091 -0.1750651 -0.082631 -0.095225 -0.0642622 0.1109337 0.1253721 -0.1126871 0.0404045 -0.3399566 -0.1739078 0.0848899 -0.0925046 0.0664878 0.109781 -0.2519902 0.1392217 -0.0479728 0.0926243 -0.2926153 -0.1185485 -0.0155337 -0.1313549 0.050526 -0.2519434 -0.1396862 -0.0469243 -0.0928058 -0.2905726 0.1211543 -0.0148929 0.1339655 0.0485073 -0.0419362 -0.0345919 -0.0438063 -0.0009145 -0.0683323 -0.0796074 0.0033938 -0.0989406 0.0228457 -0.0309688 0.054198 -0.0428599 0.0644147 0.0135052 0.0702278 -0.0056893 0.1015614 -0.0884993 -0.0418977 0.0342232 -0.044092 0.0009355 -0.0668713 0.0803481 0.0033675 0.0996776 0.0213682 -0.0309604 -0.0545306 -0.0424033 -0.0644476 0.0120808 -0.0710357 -0.0051586 -0.1023982 -0.0870856 0.0734368 -0.0321139 -0.0241232 -0.0727407 0.1223375 0.0660455 0.0360674 0.0642435 -0.0936995 0.0734268 0.0319722 -0.0243254 0.073059 0.1213047 -0.0677177 0.0355513 -0.065928 -0.0926653 -0.0449389 -0.10624 0.0466106 -0.1610179 0.1404656 0.049608 0.0375029 0.0583748 0.0588748 0.1018766 -0.0460232 0.021923 -0.0244282 0.1477226 0.082113 -0.0054237 0.0647288 -0.0964476 -0.0449186 0.1066599 0.0457305 0.1613386 0.1395772 -0.0502063 0.0361975 -0.0589746 0.0597725 0.1018893 0.0462273 0.0216251 0.0244224 0.1465284 -0.084008 -0.0055406 -0.0666132 -0.0952712 unknown
polarizability: 147.1476152|0.0561991|56.704617|15.1662935|0.019801|62.9128251 unknown
InChI: InChI=1S/C6H10S/c1-3-5-7-6-4-2/h3-4H,1-2,5-6H2
charge 0 multiplicity 1
17 atoms
S  -0.00005 -0.596498 0.002425
C  -1.452497 0.654677 -0.068516
C  1.452394 0.655277 0.063136
C  -2.705397 -0.007546 0.431568
C  2.705333 -0.011059 -0.431351
C  -3.792385 -0.269317 -0.339078
C  3.791979 -0.266987 0.341739
H  -1.159009 1.494187 0.587555
H  -1.559272 1.012837 -1.105737
H  1.158854 1.489328 -0.59984
H  1.559107 1.021982 1.097374
H  -2.705117 -0.296724 1.491932
H  2.705381 -0.30853 -1.489417
H  -4.68409 -0.752662 0.074768
H  -3.818346 -0.008513 -1.404342
H  4.683763 -0.75371 -0.067953
H  3.817553 0.002157 1.404937
